{"text_format":"1","workbook":"xlsx","n_sheets":7,"sheets":["Properties","Table Format","Automated Table","Interactive Table Format","Assign Colors","Colored Periodic Table","Interactive Periodic Table"],"not_rendered":{"charts":0,"images":0,"macros":1,"external_links":0,"defined_names":0,"comments":0,"pivot_tables":0},"unopened":[],"bounds":{"document_bytes":16777216,"sheet_cells":100000,"rows_first":2000,"rows_last":500,"rows_between":2000,"halvings":0,"cell_chars":16384,"cell_head_chars":4096},"cells_cut":0,"cells_raw":0,"read":"whole","date_system":"1900"}

{"sheet":"Properties","index":0,"n_rows":122,"n_cols":6,"rows_kept":122,"cut":false,"hidden":false,"merged":[[1,1,1,5]]}
[]
[null,"Element Properties"]
[]
[null,"Element Symbol","Atomic Number","Element Name","Atomic Mass","Element Type"]
[null,"H",1,"Hydrogen",1.008,"Non-metal"]
[null,"He",2,"Helium",4.0026000000000002,"Noble gas"]
[null,"Li",3,"Lithium",6.94,"Alkali metal"]
[null,"Be",4,"Beryllium",9.0122,"Alkali earth metal"]
[null,"B",5,"Boron",10.81,"Metalloid"]
[null,"C",6,"Carbon",12.010999999999999,"Non-metal"]
[null,"N",7,"Nitrogen",14.007,"Non-metal"]
[null,"O",8,"Oxygen",15.999000000000001,"Non-metal"]
[null,"F",9,"Fluorine",18.998000000000001,"Halogen"]
[null,"Ne",10,"Neon",20.18,"Noble gas"]
[null,"Na",11,"Sodium",22.99,"Alkali metal"]
[null,"Mg",12,"Magnesium",24.305,"Alkali earth metal"]
[null,"Al",13,"Aluminum",26.981999999999999,"Post-transition metal"]
[null,"Si",14,"Silicon",28.085000000000001,"Metalloid"]
[null,"P",15,"Phosphorus",30.974,"Non-metal"]
[null,"S",16,"Sulfur",32.06,"Non-metal"]
[null,"Cl",17,"Chlorine",35.450000000000003,"Halogen"]
[null,"Ar",18,"Argon",39.948,"Noble gas"]
[null,"K",19,"Potassium",39.097999999999999,"Alkali metal"]
[null,"Ca",20,"Calcium",40.078000000000003,"Alkali earth metal"]
[null,"Sc",21,"Scandium",44.956000000000003,"Transition metal"]
[null,"Ti",22,"Titanium",47.866999999999997,"Transition metal"]
[null,"V",23,"Vanadium",50.942,"Transition metal"]
[null,"Cr",24,"Chromium",51.996000000000002,"Transition metal"]
[null,"Mn",25,"Manganese",54.938000000000002,"Transition metal"]
[null,"Fe",26,"Iron",55.844999999999999,"Transition metal"]
[null,"Ni",28,"Nickel",58.692999999999998,"Transition metal"]
[null,"Co",27,"Cobalt",58.933,"Transition metal"]
[null,"Cu",29,"Copper",63.545999999999999,"Transition metal"]
[null,"Zn",30,"Zinc",65.38,"Transition metal"]
[null,"Ga",31,"Gallium",69.722999999999999,"Post-transition metal"]
[null,"Ge",32,"Germanium",72.63,"Metalloid"]
[null,"As",33,"Arsenic",74.921999999999997,"Metalloid"]
[null,"Se",34,"Selenium",78.971000000000004,"Non-metal"]
[null,"Br",35,"Bromine",79.903999999999996,"Halogen"]
[null,"Kr",36,"Krypton",83.798000000000002,"Noble gas"]
[null,"Rb",37,"Rubidium",85.468000000000004,"Alkali metal"]
[null,"Sr",38,"Strontium",87.62,"Alkali earth metal"]
[null,"Y",39,"Yttrium",88.906000000000006,"Transition metal"]
[null,"Zr",40,"Zirconium",91.224000000000004,"Transition metal"]
[null,"Nb",41,"Niobium",92.906000000000006,"Transition metal"]
[null,"Mo",42,"Molybdenum",95.95,"Transition metal"]
[null,"Tc",43,"Technetium",98,"Transition metal"]
[null,"Ru",44,"Ruthenium",101.07,"Transition metal"]
[null,"Rh",45,"Rhodium",102.91,"Transition metal"]
[null,"Pd",46,"Palladium",106.42,"Transition metal"]
[null,"Ag",47,"Silver",107.87,"Transition metal"]
[null,"Cd",48,"Cadmium",112.41,"Transition metal"]
[null,"In",49,"Indium",114.82,"Post-transition metal"]
[null,"Sn",50,"Tin",118.71,"Post-transition metal"]
[null,"Sb",51,"Antimony",121.76,"Metalloid"]
[null,"I",53,"Iodine",126.9,"Halogen"]
[null,"Te",52,"Tellurium",127.6,"Metalloid"]
[null,"Xe",54,"Xenon",131.29,"Noble gas"]
[null,"Cs",55,"Cesium",132.91,"Alkali metal"]
[null,"Ba",56,"Barium",137.33000000000001,"Alkali earth metal"]
[null,"La",57,"Lanthanum",138.91,"Lanthanoid element"]
[null,"Ce",58,"Cerium",140.12,"Lanthanoid element"]
[null,"Pr",59,"Praseodymium",140.91,"Lanthanoid element"]
[null,"Nd",60,"Neodymium",144.24,"Lanthanoid element"]
[null,"Pm",61,"Promethium",145,"Lanthanoid element"]
[null,"Sm",62,"Samarium",150.36000000000001,"Lanthanoid element"]
[null,"Eu",63,"Europium",151.96,"Lanthanoid element"]
[null,"Gd",64,"Gadolinium",157.25,"Lanthanoid element"]
[null,"Tb",65,"Terbium",158.93,"Lanthanoid element"]
[null,"Dy",66,"Dysprosium",162.5,"Lanthanoid element"]
[null,"Ho",67,"Holmium",164.93,"Lanthanoid element"]
[null,"Er",68,"Erbium",167.26,"Lanthanoid element"]
[null,"Tm",69,"Thulium",168.93,"Lanthanoid element"]
[null,"Yb",70,"Ytterbium",173.05,"Lanthanoid element"]
[null,"Lu",71,"Lutetium",174.97,"Lanthanoid element"]
[null,"Hf",72,"Hafnium",178.49,"Transition metal"]
[null,"Ta",73,"Tantalum",180.95,"Transition metal"]
[null,"W",74,"Tungsten",183.84,"Transition metal"]
[null,"Re",75,"Rhenium",186.21,"Transition metal"]
[null,"Os",76,"Osmium",190.23,"Transition metal"]
[null,"Ir",77,"Iridium",192.22,"Transition metal"]
[null,"Pt",78,"Platinum",195.08,"Transition metal"]
[null,"Au",79,"Gold",196.97,"Transition metal"]
[null,"Hg",80,"Mercury",200.59,"Transition metal"]
[null,"Tl",81,"Thallium",204.38,"Post-transition metal"]
[null,"Pb",82,"Lead",207.2,"Post-transition metal"]
[null,"Bi",83,"Bismuth",208.98,"Post-transition metal"]
[null,"Po",84,"Polonium",209,"Post-transition metal"]
[null,"At",85,"Astatine",210,"Halogen"]
[null,"Rn",86,"Radon",222,"Noble gas"]
[null,"Fr",87,"Francium",223,"Alkali metal"]
[null,"Ra",88,"Radium",226,"Alkali earth metal"]
[null,"Ac",89,"Actinium",227,"Actinoid element"]
[null,"Pa",91,"Protactinium",231.04,"Actinoid element"]
[null,"Th",90,"Thorium",232.04,"Actinoid element"]
[null,"Np",93,"Neptunium",237,"Actinoid element"]
[null,"U",92,"Uranium",238.03,"Actinoid element"]
[null,"Am",95,"Americium",243,"Actinoid element"]
[null,"Pu",94,"Plutonium",244,"Actinoid element"]
[null,"Cm",96,"Curium",247,"Actinoid element"]
[null,"Bk",97,"Berkelium",247,"Actinoid element"]
[null,"Cf",98,"Californium",251,"Actinoid element"]
[null,"Es",99,"Einsteinium",252,"Actinoid element"]
[null,"Fm",100,"Fermium",257,"Actinoid element"]
[null,"Md",101,"Mendelevium",258,"Actinoid element"]
[null,"No",102,"Nobelium",259,"Actinoid element"]
[null,"Lr",103,"Lawrencium",266,"Actinoid element"]
[null,"Rf",104,"Rutherfordium",267,"Transition metal"]
[null,"Db",105,"Dubnium",270,"Transition metal"]
[null,"Sg",106,"Seaborgium",271,"Transition metal"]
[null,"Bh",107,"Bohrium",270,"Transition metal"]
[null,"Hs",108,"Hassium",277,"Transition metal"]
[null,"Mt",109,"Meitnerium",276,"Transition metal"]
[null,"Ds",110,"Darmstadtium",281,"Transition metal"]
[null,"Rg",111,"Roentgenium",280,"Transition metal"]
[null,"Cn",112,"Copernicium",285,"Transition metal"]
[null,"Nh",113,"Nihonium",284,"Alkali metal"]
[null,"Fl",114,"Flerovium",289,"Post-transition metal"]
[null,"Mc",115,"Moscovium",288,"Post-transition metal"]
[null,"Lv",116,"Livermorium",293,"Post-transition metal"]
[null,"Ts",117,"Tennessine",294,"Halogen"]
[null,"Og",118,"Oganesson",294,"Noble gas"]

{"sheet":"Table Format","index":1,"n_rows":18,"n_cols":21,"rows_kept":18,"cut":false,"hidden":false,"merged":[[8,1,14,1],[16,4,16,5],[17,4,17,5],[1,3,1,20]]}
[]
[null,null,null,"Periodic Table Format"]
[]
[]
[]
[]
[null,null,null,"Group"]
[null,null,null,1,null,null,null,null,null,null,null,null,null,null,null,null,null,null,null,null,18]
[null,"Period",1,"H",2,null,null,null,null,null,null,null,null,null,null,13,14,15,16,17,"He"]
[null,null,2,"Li","Be",null,null,null,null,null,null,null,null,null,null,"B","C","N","O","F","Ne"]
[null,null,3,"Na","Mg",3,4,5,6,7,8,9,10,11,12,"Al","Si","P","S","Cl","Ar"]
[null,null,4,"K","Ca","Sc","Ti","V","Cr","Mn","Fe","Co","Ni","Cu","Zn","Ga","Ge","As","Se","Br","Kr"]
[null,null,5,"Rb","Sr","Y","Zr","Nb","Mo","Tc","Ru","Rh","Pd","Ag","Cd","In","Sn","Sb","Te","I","Xe"]
[null,null,6,"Cs","Ba",null,"Hf","Ta","W","Re","Os","Ir","Pt","Au","Hg","Tl","Pb","Bi","Po","At","Rn"]
[null,null,7,"Fr","Ra",null,"Rf","Db","Sg","Bh","Hs","Mt","Ds","Rg","Cn","Nh","Fl","Mc","Lv","Ts","Og"]
[]
[null,null,null,null,"Lanthanoid Series",null,"La","Ce","Pr","Nd","Pm","Sm","Eu","Gd","Tb","Dy","Ho","Er","Tm","Yb","Lu"]
[null,null,null,null,"Actinoid Series",null,"Ac","Th","Pa","U","Np","Pu","Am","Cm","Bk","Cf","Es","Fm","Md","No","Lr"]

{"sheet":"Automated Table","index":2,"n_rows":18,"n_cols":21,"rows_kept":18,"cut":false,"hidden":false,"merged":[[8,10,8,12],[3,10,3,12],[4,10,6,12],[7,10,7,12],[1,3,1,20],[8,1,14,1],[16,4,16,5],[17,4,17,5],[3,3,3,4],[4,3,4,4]]}
[]
[null,null,null,"Automated Periodic Table with Excel Formulas"]
[]
[null,null,null,"Enter the symbol",null,null,null,null,null,null,{"$f":"IFERROR(VLOOKUP($D$5, Properties!$B$5:$F$122,2,FALSE), \"\")","v":1}]
[null,null,null,"H",null,null,null,null,null,null,{"$f":"IFERROR(VLOOKUP($D$5, Properties!$B$5:$F$122,1,FALSE), \"\")","v":"H"}]
[]
[null,null,null,"Group"]
[null,null,null,1,null,null,null,null,null,null,{"$f":"IFERROR(VLOOKUP($D$5, Properties!$B$5:$F$122,3,FALSE), \"\")","v":"Hydrogen"},null,null,null,null,null,null,null,null,null,18]
[null,"Period",1,"H",2,null,null,null,null,null,{"$f":"IFERROR(VLOOKUP($D$5, Properties!$B$5:$F$122,4,FALSE), \"\")","v":1.008},null,null,null,null,13,14,15,16,17,"He"]
[null,null,2,"Li","Be",null,null,null,null,null,null,null,null,null,null,"B","C","N","O","F","Ne"]
[null,null,3,"Na","Mg",3,4,5,6,7,8,9,10,11,12,"Al","Si","P","S","Cl","Ar"]
[null,null,4,"K","Ca","Sc","Ti","V","Cr","Mn","Fe","Co","Ni","Cu","Zn","Ga","Ge","As","Se","Br","Kr"]
[null,null,5,"Rb","Sr","Y","Zr","Nb","Mo","Tc","Ru","Rh","Pd","Ag","Cd","In","Sn","Sb","Te","I","Xe"]
[null,null,6,"Cs","Ba",null,"Hf","Ta","W","Re","Os","Ir","Pt","Au","Hg","Tl","Pb","Bi","Po","At","Rn"]
[null,null,7,"Fr","Ra",null,"Rf","Db","Sg","Bh","Hs","Mt","Ds","Rg","Cn","Nh","Fl","Mc","Lv","Ts","Og"]
[]
[null,null,null,null,"Lanthanoid Series",null,"La","Ce","Pr","Nd","Pm","Sm","Eu","Gd","Tb","Dy","Ho","Er","Tm","Yb","Lu"]
[null,null,null,null,"Actinoid Series",null,"Ac","Th","Pa","U","Np","Pu","Am","Cm","Bk","Cf","Es","Fm","Md","No","Lr"]

{"sheet":"Interactive Table Format","index":3,"n_rows":27,"n_cols":21,"rows_kept":27,"cut":false,"hidden":false,"merged":[[1,3,1,20],[17,1,23,1],[25,4,25,5],[26,4,26,5],[3,3,3,4]]}
[]
[null,null,null,"Interactive Table Format"]
[]
[null,null,null,"Element Type"]
[null,null,null,"Alkali metal"]
[null,null,null,"Alkali earth metal"]
[null,null,null,"Metalloid"]
[null,null,null,"Non-metal"]
[null,null,null,"Halogen"]
[null,null,null,"Noble gas"]
[null,null,null,"Transition metal"]
[null,null,null,"Post-transition metal"]
[null,null,null,"Lanthanoid element"]
[null,null,null,"Actinoid element"]
[]
[null,null,null,"Group"]
[null,null,null,1,null,null,null,null,null,null,null,null,null,null,null,null,null,null,null,null,18]
[null,"Period",1,"H",2,null,null,null,null,null,null,null,null,null,null,13,14,15,16,17,"He"]
[null,null,2,"Li","Be",null,null,null,null,null,null,null,null,null,null,"B","C","N","O","F","Ne"]
[null,null,3,"Na","Mg",3,4,5,6,7,8,9,10,11,12,"Al","Si","P","S","Cl","Ar"]
[null,null,4,"K","Ca","Sc","Ti","V","Cr","Mn","Fe","Co","Ni","Cu","Zn","Ga","Ge","As","Se","Br","Kr"]
[null,null,5,"Rb","Sr","Y","Zr","Nb","Mo","Tc","Ru","Rh","Pd","Ag","Cd","In","Sn","Sb","Te","I","Xe"]
[null,null,6,"Cs","Ba",null,"Hf","Ta","W","Re","Os","Ir","Pt","Au","Hg","Tl","Pb","Bi","Po","At","Rn"]
[null,null,7,"Fr","Ra",null,"Rf","Db","Sg","Bh","Hs","Mt","Ds","Rg","Cn","Nh","Fl","Mc","Lv","Ts","Og"]
[]
[null,null,null,null,"Lanthanoid Series",null,"La","Ce","Pr","Nd","Pm","Sm","Eu","Gd","Tb","Dy","Ho","Er","Tm","Yb","Lu"]
[null,null,null,null,"Actinoid Series",null,"Ac","Th","Pa","U","Np","Pu","Am","Cm","Bk","Cf","Es","Fm","Md","No","Lr"]

{"sheet":"Assign Colors","index":4,"n_rows":27,"n_cols":21,"rows_kept":27,"cut":false,"hidden":false,"merged":[[1,3,1,20],[3,3,3,5],[17,1,23,1],[25,4,25,5],[26,4,26,5]]}
[]
[null,null,null,"Assigning Colors for Different Element Types"]
[]
[null,null,null,"Element Type"]
[null,null,null,"Alkali metal"]
[null,null,null,"Alkali earth metal"]
[null,null,null,"Metalloid"]
[null,null,null,"Non-metal"]
[null,null,null,"Halogen"]
[null,null,null,"Noble gas"]
[null,null,null,"Transition metal"]
[null,null,null,"Post-transition metal"]
[null,null,null,"Lanthanoid element"]
[null,null,null,"Actinoid element"]
[]
[null,null,null,"Group"]
[null,null,null,1,null,null,null,null,null,null,null,null,null,null,null,null,null,null,null,null,18]
[null,"Period",1,"H",2,null,null,null,null,null,null,null,null,null,null,13,14,15,16,17,"He"]
[null,null,2,"Li","Be",null,null,null,null,null,null,null,null,null,null,"B","C","N","O","F","Ne"]
[null,null,3,"Na","Mg",3,4,5,6,7,8,9,10,11,12,"Al","Si","P","S","Cl","Ar"]
[null,null,4,"K","Ca","Sc","Ti","V","Cr","Mn","Fe","Co","Ni","Cu","Zn","Ga","Ge","As","Se","Br","Kr"]
[null,null,5,"Rb","Sr","Y","Zr","Nb","Mo","Tc","Ru","Rh","Pd","Ag","Cd","In","Sn","Sb","Te","I","Xe"]
[null,null,6,"Cs","Ba",null,"Hf","Ta","W","Re","Os","Ir","Pt","Au","Hg","Tl","Pb","Bi","Po","At","Rn"]
[null,null,7,"Fr","Ra",null,"Rf","Db","Sg","Bh","Hs","Mt","Ds","Rg","Cn","Nh","Fl","Mc","Lv","Ts","Og"]
[]
[null,null,null,null,"Lanthanoid Series",null,"La","Ce","Pr","Nd","Pm","Sm","Eu","Gd","Tb","Dy","Ho","Er","Tm","Yb","Lu"]
[null,null,null,null,"Actinoid Series",null,"Ac","Th","Pa","U","Np","Pu","Am","Cm","Bk","Cf","Es","Fm","Md","No","Lr"]

{"sheet":"Colored Periodic Table","index":5,"n_rows":27,"n_cols":21,"rows_kept":27,"cut":false,"hidden":false,"merged":[[1,3,1,20],[3,3,3,5],[17,1,23,1],[25,4,25,5],[26,4,26,5]]}
[]
[null,null,null,"Assigning Colors to Periodic Table Based on Element Type"]
[]
[null,null,null,"Element Type"]
[null,null,null,"Alkali metal"]
[null,null,null,"Alkali earth metal"]
[null,null,null,"Metalloid"]
[null,null,null,"Non-metal"]
[null,null,null,"Halogen"]
[null,null,null,"Noble gas"]
[null,null,null,"Transition metal"]
[null,null,null,"Post-transition metal"]
[null,null,null,"Lanthanoid element"]
[null,null,null,"Actinoid element"]
[]
[null,null,null,"Group"]
[null,null,null,1,null,null,null,null,null,null,null,null,null,null,null,null,null,null,null,null,18]
[null,"Period",1,"H",2,null,null,null,null,null,null,null,null,null,null,13,14,15,16,17,"He"]
[null,null,2,"Li","Be",null,null,null,null,null,null,null,null,null,null,"B","C","N","O","F","Ne"]
[null,null,3,"Na","Mg",3,4,5,6,7,8,9,10,11,12,"Al","Si","P","S","Cl","Ar"]
[null,null,4,"K","Ca","Sc","Ti","V","Cr","Mn","Fe","Co","Ni","Cu","Zn","Ga","Ge","As","Se","Br","Kr"]
[null,null,5,"Rb","Sr","Y","Zr","Nb","Mo","Tc","Ru","Rh","Pd","Ag","Cd","In","Sn","Sb","Te","I","Xe"]
[null,null,6,"Cs","Ba",null,"Hf","Ta","W","Re","Os","Ir","Pt","Au","Hg","Tl","Pb","Bi","Po","At","Rn"]
[null,null,7,"Fr","Ra",null,"Rf","Db","Sg","Bh","Hs","Mt","Ds","Rg","Cn","Nh","Fl","Mc","Lv","Ts","Og"]
[]
[null,null,null,null,"Lanthanoid Series",null,"La","Ce","Pr","Nd","Pm","Sm","Eu","Gd","Tb","Dy","Ho","Er","Tm","Yb","Lu"]
[null,null,null,null,"Actinoid Series",null,"Ac","Th","Pa","U","Np","Pu","Am","Cm","Bk","Cf","Es","Fm","Md","No","Lr"]

{"sheet":"Interactive Periodic Table","index":6,"n_rows":27,"n_cols":21,"rows_kept":27,"cut":false,"hidden":false,"merged":[[1,3,1,20],[3,3,3,5],[17,1,23,1],[25,4,25,5],[26,4,26,5],[3,18,4,20],[12,18,13,20],[5,18,9,20],[10,18,11,20]]}
[]
[null,null,null,"Interactive Periodic Table"]
[]
[null,null,null,"Element Type",null,null,null,null,null,null,null,null,null,null,null,null,null,null,1]
[null,null,null,"Alkali metal"]
[null,null,null,"Alkali earth metal",null,null,null,null,null,null,null,null,null,null,null,null,null,null,"H"]
[null,null,null,"Metalloid"]
[null,null,null,"Non-metal"]
[null,null,null,"Halogen"]
[null,null,null,"Noble gas"]
[null,null,null,"Transition metal",null,null,null,null,null,null,null,null,null,null,null,null,null,null,"Hydrogen"]
[null,null,null,"Post-transition metal"]
[null,null,null,"Lanthanoid element",null,null,null,null,null,null,null,null,null,null,null,null,null,null,1.008]
[null,null,null,"Actinoid element"]
[]
[null,null,null,"Group"]
[null,null,null,1,null,null,null,null,null,null,null,null,null,null,null,null,null,null,null,null,18]
[null,"Period",1,"H",2,null,null,null,null,null,null,null,null,null,null,13,14,15,16,17,"He"]
[null,null,2,"Li","Be",null,null,null,null,null,null,null,null,null,null,"B","C","N","O","F","Ne"]
[null,null,3,"Na","Mg",3,4,5,6,7,8,9,10,11,12,"Al","Si","P","S","Cl","Ar"]
[null,null,4,"K","Ca","Sc","Ti","V","Cr","Mn","Fe","Co","Ni","Cu","Zn","Ga","Ge","As","Se","Br","Kr"]
[null,null,5,"Rb","Sr","Y","Zr","Nb","Mo","Tc","Ru","Rh","Pd","Ag","Cd","In","Sn","Sb","Te","I","Xe"]
[null,null,6,"Cs","Ba",null,"Hf","Ta","W","Re","Os","Ir","Pt","Au","Hg","Tl","Pb","Bi","Po","At","Rn"]
[null,null,7,"Fr","Ra",null,"Rf","Db","Sg","Bh","Hs","Mt","Ds","Rg","Cn","Nh","Fl","Mc","Lv","Ts","Og"]
[]
[null,null,null,null,"Lanthanoid Series",null,"La","Ce","Pr","Nd","Pm","Sm","Eu","Gd","Tb","Dy","Ho","Er","Tm","Yb","Lu"]
[null,null,null,null,"Actinoid Series",null,"Ac","Th","Pa","U","Np","Pu","Am","Cm","Bk","Cf","Es","Fm","Md","No","Lr"]