{"text_format":"1","workbook":"xlsx","n_sheets":5,"sheets":["Settings","Roster","April 2021","April 2021 (2)","May 2021"],"not_rendered":{"charts":0,"images":1,"macros":1,"external_links":0,"defined_names":5,"comments":0,"pivot_tables":0},"unopened":[],"bounds":{"document_bytes":16777216,"sheet_cells":100000,"rows_first":2000,"rows_last":500,"rows_between":2000,"halvings":0,"cell_chars":16384,"cell_head_chars":4096},"cells_cut":0,"cells_raw":0,"read":"whole","date_system":"1900"}

{"sheet":"Settings","index":0,"n_rows":16,"n_cols":29,"rows_kept":16,"cut":false,"hidden":false,"merged":[[1,1,1,6]]}
[]
[null,"Roster Settings",null,null,null,null,null,null,null,null,null,null,null,null,null,null,null,null,null,null,null,null,"Set",null,null,null,null,null,"ings"]
[]
[null,"Months","Years","Weekends","Shift Types","Shift Codes","Employee Name"]
[null,"January",2021,"Sat","Day","D1","Jack"]
[null,"February",2022,"Sun","Night","D2","Bill"]
[null,"March",2023,null,null,"D3","Terry"]
[null,"April",2024,null,null,"N1","William"]
[null,"May",null,null,null,"N2","Jesse"]
[null,"June",null,null,null,"N3","Diane"]
[null,"July",null,null,null,null,"Christine"]
[null,"August",null,null,null,null,"Shirley"]
[null,"September",null,null,null,null,"Ralph"]
[null,"October",null,null,null,null,"Michael"]
[null,"November"]
[null,"December"]

{"sheet":"Roster","index":1,"n_rows":20,"n_cols":38,"rows_kept":20,"cut":false,"hidden":false,"merged":[[1,36,3,37],[3,4,3,8],[3,10,3,11],[3,12,3,14],[3,15,3,17],[3,32,3,34],[1,1,3,2],[1,4,2,21],[1,22,2,27],[1,28,2,31],[1,32,2,34],[3,18,3,19],[3,20,3,22],[3,23,3,25],[3,26,3,27],[3,28,3,30],[19,1,19,2],[5,1,6,1],[5,2,6,2],[5,36,6,36],[5,37,6,37],[6,3,16,3],[18,1,18,2]]}
[]
[null,"Logo",null,null,"Roster of",null,null,null,null,null,null,null,null,null,null,null,null,null,null,null,null,null,"January",null,null,null,null,null,2021,null,null,null,null,null,null,null,"Final Report"]
[]
[null,null,null,null,"Month Starting Date:",null,null,null,null,1,null,null,"Start Date:",null,null,{"$f":"IFERROR(DATEVALUE(J4&W2&AC2),\"\")","v":"2021-01-01"},null,null,null,null,"End Date:",null,null,{"$f":"IFERROR(EOMONTH(P4,0)+J4-1,\"\")","v":"2021-01-31"},null,null,null,null,"Total Days:",null,null,{"$f":"X4-P4+1","v":31}]
[]
[null,"Employee","Starting Shift",null,{"$f":"TEXT(E7,\"ddd\")","v":"Fri"},{"$f":"TEXT(F7,\"ddd\")","v":"Sat"},"Sun","Mon","Tue","Wed","Thu","Fri","Sat","Sun","Mon","Tue","Wed","Thu","Fri","Sat","Sun","Mon","Tue","Wed","Thu","Fri","Sat","Sun","Mon","Tue","Wed","Thu","Fri","Sat","Sun",null,"Total Day Shifts","Total Night Shifts"]
[null,null,null,null,{"$f":"P4","v":"2021-01-01"},{"$f":"IF(E7>=$X$4,\"\",E7+1)","v":"2021-01-02"},"2021-01-03","2021-01-04","2021-01-05","2021-01-06","2021-01-07","2021-01-08","2021-01-09","2021-01-10","2021-01-11","2021-01-12","2021-01-13","2021-01-14","2021-01-15","2021-01-16","2021-01-17","2021-01-18","2021-01-19","2021-01-20","2021-01-21","2021-01-22","2021-01-23","2021-01-24","2021-01-25","2021-01-26","2021-01-27","2021-01-28","2021-01-29","2021-01-30","2021-01-31"]
[null,"Jack","D3",null,{"$f":"IF(OR($C8=\"\",E$7=\"\"),\"\",IF(D8=\"\",C8,INDEX(Shift_Codes,IF(MATCH(D8,Shift_Codes,0)+1>COUNTA(Shift_Codes),1,MATCH(D8,Shift_Codes,0)+1))))","v":"D3"},{"$f":"IF(OR($C8=\"\",F$7=\"\"),\"\",IF(E8=\"\",D8,INDEX(Shift_Codes,IF(MATCH(E8,Shift_Codes,0)+1>COUNTA(Shift_Codes),1,MATCH(E8,Shift_Codes,0)+1))))","v":"N1"},{"$f":"IF(OR($C8=\"\",G$7=\"\"),\"\",IF(F8=\"\",E8,INDEX(Shift_Codes,IF(MATCH(F8,Shift_Codes,0)+1>COUNTA(Shift_Codes),1,MATCH(F8,Shift_Codes,0)+1))))","v":"N2"},{"$f":"IF(OR($C8=\"\",H$7=\"\"),\"\",IF(G8=\"\",F8,INDEX(Shift_Codes,IF(MATCH(G8,Shift_Codes,0)+1>COUNTA(Shift_Codes),1,MATCH(G8,Shift_Codes,0)+1))))","v":"N3"},{"$f":"IF(OR($C8=\"\",I$7=\"\"),\"\",IF(H8=\"\",G8,INDEX(Shift_Codes,IF(MATCH(H8,Shift_Codes,0)+1>COUNTA(Shift_Codes),1,MATCH(H8,Shift_Codes,0)+1))))","v":"D1"},{"$f":"IF(OR($C8=\"\",J$7=\"\"),\"\",IF(I8=\"\",H8,INDEX(Shift_Codes,IF(MATCH(I8,Shift_Codes,0)+1>COUNTA(Shift_Codes),1,MATCH(I8,Shift_Codes,0)+1))))","v":"D2"},{"$f":"IF(OR($C8=\"\",K$7=\"\"),\"\",IF(J8=\"\",I8,INDEX(Shift_Codes,IF(MATCH(J8,Shift_Codes,0)+1>COUNTA(Shift_Codes),1,MATCH(J8,Shift_Codes,0)+1))))","v":"D3"},{"$f":"IF(OR($C8=\"\",L$7=\"\"),\"\",IF(K8=\"\",J8,INDEX(Shift_Codes,IF(MATCH(K8,Shift_Codes,0)+1>COUNTA(Shift_Codes),1,MATCH(K8,Shift_Codes,0)+1))))","v":"N1"},{"$f":"IF(OR($C8=\"\",M$7=\"\"),\"\",IF(L8=\"\",K8,INDEX(Shift_Codes,IF(MATCH(L8,Shift_Codes,0)+1>COUNTA(Shift_Codes),1,MATCH(L8,Shift_Codes,0)+1))))","v":"N2"},{"$f":"IF(OR($C8=\"\",N$7=\"\"),\"\",IF(M8=\"\",L8,INDEX(Shift_Codes,IF(MATCH(M8,Shift_Codes,0)+1>COUNTA(Shift_Codes),1,MATCH(M8,Shift_Codes,0)+1))))","v":"N3"},{"$f":"IF(OR($C8=\"\",O$7=\"\"),\"\",IF(N8=\"\",M8,INDEX(Shift_Codes,IF(MATCH(N8,Shift_Codes,0)+1>COUNTA(Shift_Codes),1,MATCH(N8,Shift_Codes,0)+1))))","v":"D1"},{"$f":"IF(OR($C8=\"\",P$7=\"\"),\"\",IF(O8=\"\",N8,INDEX(Shift_Codes,IF(MATCH(O8,Shift_Codes,0)+1>COUNTA(Shift_Codes),1,MATCH(O8,Shift_Codes,0)+1))))","v":"D2"},{"$f":"IF(OR($C8=\"\",Q$7=\"\"),\"\",IF(P8=\"\",O8,INDEX(Shift_Codes,IF(MATCH(P8,Shift_Codes,0)+1>COUNTA(Shift_Codes),1,MATCH(P8,Shift_Codes,0)+1))))","v":"D3"},{"$f":"IF(OR($C8=\"\",R$7=\"\"),\"\",IF(Q8=\"\",P8,INDEX(Shift_Codes,IF(MATCH(Q8,Shift_Codes,0)+1>COUNTA(Shift_Codes),1,MATCH(Q8,Shift_Codes,0)+1))))","v":"N1"},{"$f":"IF(OR($C8=\"\",S$7=\"\"),\"\",IF(R8=\"\",Q8,INDEX(Shift_Codes,IF(MATCH(R8,Shift_Codes,0)+1>COUNTA(Shift_Codes),1,MATCH(R8,Shift_Codes,0)+1))))","v":"N2"},{"$f":"IF(OR($C8=\"\",T$7=\"\"),\"\",IF(S8=\"\",R8,INDEX(Shift_Codes,IF(MATCH(S8,Shift_Codes,0)+1>COUNTA(Shift_Codes),1,MATCH(S8,Shift_Codes,0)+1))))","v":"N3"},{"$f":"IF(OR($C8=\"\",U$7=\"\"),\"\",IF(T8=\"\",S8,INDEX(Shift_Codes,IF(MATCH(T8,Shift_Codes,0)+1>COUNTA(Shift_Codes),1,MATCH(T8,Shift_Codes,0)+1))))","v":"D1"},{"$f":"IF(OR($C8=\"\",V$7=\"\"),\"\",IF(U8=\"\",T8,INDEX(Shift_Codes,IF(MATCH(U8,Shift_Codes,0)+1>COUNTA(Shift_Codes),1,MATCH(U8,Shift_Codes,0)+1))))","v":"D2"},{"$f":"IF(OR($C8=\"\",W$7=\"\"),\"\",IF(V8=\"\",U8,INDEX(Shift_Codes,IF(MATCH(V8,Shift_Codes,0)+1>COUNTA(Shift_Codes),1,MATCH(V8,Shift_Codes,0)+1))))","v":"D3"},{"$f":"IF(OR($C8=\"\",X$7=\"\"),\"\",IF(W8=\"\",V8,INDEX(Shift_Codes,IF(MATCH(W8,Shift_Codes,0)+1>COUNTA(Shift_Codes),1,MATCH(W8,Shift_Codes,0)+1))))","v":"N1"},{"$f":"IF(OR($C8=\"\",Y$7=\"\"),\"\",IF(X8=\"\",W8,INDEX(Shift_Codes,IF(MATCH(X8,Shift_Codes,0)+1>COUNTA(Shift_Codes),1,MATCH(X8,Shift_Codes,0)+1))))","v":"N2"},{"$f":"IF(OR($C8=\"\",Z$7=\"\"),\"\",IF(Y8=\"\",X8,INDEX(Shift_Codes,IF(MATCH(Y8,Shift_Codes,0)+1>COUNTA(Shift_Codes),1,MATCH(Y8,Shift_Codes,0)+1))))","v":"N3"},{"$f":"IF(OR($C8=\"\",AA$7=\"\"),\"\",IF(Z8=\"\",Y8,INDEX(Shift_Codes,IF(MATCH(Z8,Shift_Codes,0)+1>COUNTA(Shift_Codes),1,MATCH(Z8,Shift_Codes,0)+1))))","v":"D1"},{"$f":"IF(OR($C8=\"\",AB$7=\"\"),\"\",IF(AA8=\"\",Z8,INDEX(Shift_Codes,IF(MATCH(AA8,Shift_Codes,0)+1>COUNTA(Shift_Codes),1,MATCH(AA8,Shift_Codes,0)+1))))","v":"D2"},{"$f":"IF(OR($C8=\"\",AC$7=\"\"),\"\",IF(AB8=\"\",AA8,INDEX(Shift_Codes,IF(MATCH(AB8,Shift_Codes,0)+1>COUNTA(Shift_Codes),1,MATCH(AB8,Shift_Codes,0)+1))))","v":"D3"},{"$f":"IF(OR($C8=\"\",AD$7=\"\"),\"\",IF(AC8=\"\",AB8,INDEX(Shift_Codes,IF(MATCH(AC8,Shift_Codes,0)+1>COUNTA(Shift_Codes),1,MATCH(AC8,Shift_Codes,0)+1))))","v":"N1"},{"$f":"IF(OR($C8=\"\",AE$7=\"\"),\"\",IF(AD8=\"\",AC8,INDEX(Shift_Codes,IF(MATCH(AD8,Shift_Codes,0)+1>COUNTA(Shift_Codes),1,MATCH(AD8,Shift_Codes,0)+1))))","v":"N2"},{"$f":"IF(OR($C8=\"\",AF$7=\"\"),\"\",IF(AE8=\"\",AD8,INDEX(Shift_Codes,IF(MATCH(AE8,Shift_Codes,0)+1>COUNTA(Shift_Codes),1,MATCH(AE8,Shift_Codes,0)+1))))","v":"N3"},{"$f":"IF(OR($C8=\"\",AG$7=\"\"),\"\",IF(AF8=\"\",AE8,INDEX(Shift_Codes,IF(MATCH(AF8,Shift_Codes,0)+1>COUNTA(Shift_Codes),1,MATCH(AF8,Shift_Codes,0)+1))))","v":"D1"},{"$f":"IF(OR($C8=\"\",AH$7=\"\"),\"\",IF(AG8=\"\",AF8,INDEX(Shift_Codes,IF(MATCH(AG8,Shift_Codes,0)+1>COUNTA(Shift_Codes),1,MATCH(AG8,Shift_Codes,0)+1))))","v":"D2"},{"$f":"IF(OR($C8=\"\",AI$7=\"\"),\"\",IF(AH8=\"\",AG8,INDEX(Shift_Codes,IF(MATCH(AH8,Shift_Codes,0)+1>COUNTA(Shift_Codes),1,MATCH(AH8,Shift_Codes,0)+1))))","v":"D3"},null,{"$f":"COUNTIF($E8:$AI8,\"D*\")","v":16},{"$f":"COUNTIF($E8:$AI8,\"N*\")","v":15}]
[null,"Bill",null,null,{"$f":"IF(OR($C9=\"\",E$7=\"\"),\"\",IF(D9=\"\",C9,INDEX(Shift_Codes,IF(MATCH(D9,Shift_Codes,0)+1>COUNTA(Shift_Codes),1,MATCH(D9,Shift_Codes,0)+1))))","v":""},{"$f":"IF(OR($C9=\"\",F$7=\"\"),\"\",IF(E9=\"\",D9,INDEX(Shift_Codes,IF(MATCH(E9,Shift_Codes,0)+1>COUNTA(Shift_Codes),1,MATCH(E9,Shift_Codes,0)+1))))","v":""},{"$f":"IF(OR($C9=\"\",G$7=\"\"),\"\",IF(F9=\"\",E9,INDEX(Shift_Codes,IF(MATCH(F9,Shift_Codes,0)+1>COUNTA(Shift_Codes),1,MATCH(F9,Shift_Codes,0)+1))))","v":""},{"$f":"IF(OR($C9=\"\",H$7=\"\"),\"\",IF(G9=\"\",F9,INDEX(Shift_Codes,IF(MATCH(G9,Shift_Codes,0)+1>COUNTA(Shift_Codes),1,MATCH(G9,Shift_Codes,0)+1))))","v":""},{"$f":"IF(OR($C9=\"\",I$7=\"\"),\"\",IF(H9=\"\",G9,INDEX(Shift_Codes,IF(MATCH(H9,Shift_Codes,0)+1>COUNTA(Shift_Codes),1,MATCH(H9,Shift_Codes,0)+1))))","v":""},{"$f":"IF(OR($C9=\"\",J$7=\"\"),\"\",IF(I9=\"\",H9,INDEX(Shift_Codes,IF(MATCH(I9,Shift_Codes,0)+1>COUNTA(Shift_Codes),1,MATCH(I9,Shift_Codes,0)+1))))","v":""},{"$f":"IF(OR($C9=\"\",K$7=\"\"),\"\",IF(J9=\"\",I9,INDEX(Shift_Codes,IF(MATCH(J9,Shift_Codes,0)+1>COUNTA(Shift_Codes),1,MATCH(J9,Shift_Codes,0)+1))))","v":""},{"$f":"IF(OR($C9=\"\",L$7=\"\"),\"\",IF(K9=\"\",J9,INDEX(Shift_Codes,IF(MATCH(K9,Shift_Codes,0)+1>COUNTA(Shift_Codes),1,MATCH(K9,Shift_Codes,0)+1))))","v":""},{"$f":"IF(OR($C9=\"\",M$7=\"\"),\"\",IF(L9=\"\",K9,INDEX(Shift_Codes,IF(MATCH(L9,Shift_Codes,0)+1>COUNTA(Shift_Codes),1,MATCH(L9,Shift_Codes,0)+1))))","v":""},{"$f":"IF(OR($C9=\"\",N$7=\"\"),\"\",IF(M9=\"\",L9,INDEX(Shift_Codes,IF(MATCH(M9,Shift_Codes,0)+1>COUNTA(Shift_Codes),1,MATCH(M9,Shift_Codes,0)+1))))","v":""},{"$f":"IF(OR($C9=\"\",O$7=\"\"),\"\",IF(N9=\"\",M9,INDEX(Shift_Codes,IF(MATCH(N9,Shift_Codes,0)+1>COUNTA(Shift_Codes),1,MATCH(N9,Shift_Codes,0)+1))))","v":""},{"$f":"IF(OR($C9=\"\",P$7=\"\"),\"\",IF(O9=\"\",N9,INDEX(Shift_Codes,IF(MATCH(O9,Shift_Codes,0)+1>COUNTA(Shift_Codes),1,MATCH(O9,Shift_Codes,0)+1))))","v":""},{"$f":"IF(OR($C9=\"\",Q$7=\"\"),\"\",IF(P9=\"\",O9,INDEX(Shift_Codes,IF(MATCH(P9,Shift_Codes,0)+1>COUNTA(Shift_Codes),1,MATCH(P9,Shift_Codes,0)+1))))","v":""},{"$f":"IF(OR($C9=\"\",R$7=\"\"),\"\",IF(Q9=\"\",P9,INDEX(Shift_Codes,IF(MATCH(Q9,Shift_Codes,0)+1>COUNTA(Shift_Codes),1,MATCH(Q9,Shift_Codes,0)+1))))","v":""},{"$f":"IF(OR($C9=\"\",S$7=\"\"),\"\",IF(R9=\"\",Q9,INDEX(Shift_Codes,IF(MATCH(R9,Shift_Codes,0)+1>COUNTA(Shift_Codes),1,MATCH(R9,Shift_Codes,0)+1))))","v":""},{"$f":"IF(OR($C9=\"\",T$7=\"\"),\"\",IF(S9=\"\",R9,INDEX(Shift_Codes,IF(MATCH(S9,Shift_Codes,0)+1>COUNTA(Shift_Codes),1,MATCH(S9,Shift_Codes,0)+1))))","v":""},{"$f":"IF(OR($C9=\"\",U$7=\"\"),\"\",IF(T9=\"\",S9,INDEX(Shift_Codes,IF(MATCH(T9,Shift_Codes,0)+1>COUNTA(Shift_Codes),1,MATCH(T9,Shift_Codes,0)+1))))","v":""},{"$f":"IF(OR($C9=\"\",V$7=\"\"),\"\",IF(U9=\"\",T9,INDEX(Shift_Codes,IF(MATCH(U9,Shift_Codes,0)+1>COUNTA(Shift_Codes),1,MATCH(U9,Shift_Codes,0)+1))))","v":""},{"$f":"IF(OR($C9=\"\",W$7=\"\"),\"\",IF(V9=\"\",U9,INDEX(Shift_Codes,IF(MATCH(V9,Shift_Codes,0)+1>COUNTA(Shift_Codes),1,MATCH(V9,Shift_Codes,0)+1))))","v":""},{"$f":"IF(OR($C9=\"\",X$7=\"\"),\"\",IF(W9=\"\",V9,INDEX(Shift_Codes,IF(MATCH(W9,Shift_Codes,0)+1>COUNTA(Shift_Codes),1,MATCH(W9,Shift_Codes,0)+1))))","v":""},{"$f":"IF(OR($C9=\"\",Y$7=\"\"),\"\",IF(X9=\"\",W9,INDEX(Shift_Codes,IF(MATCH(X9,Shift_Codes,0)+1>COUNTA(Shift_Codes),1,MATCH(X9,Shift_Codes,0)+1))))","v":""},{"$f":"IF(OR($C9=\"\",Z$7=\"\"),\"\",IF(Y9=\"\",X9,INDEX(Shift_Codes,IF(MATCH(Y9,Shift_Codes,0)+1>COUNTA(Shift_Codes),1,MATCH(Y9,Shift_Codes,0)+1))))","v":""},{"$f":"IF(OR($C9=\"\",AA$7=\"\"),\"\",IF(Z9=\"\",Y9,INDEX(Shift_Codes,IF(MATCH(Z9,Shift_Codes,0)+1>COUNTA(Shift_Codes),1,MATCH(Z9,Shift_Codes,0)+1))))","v":""},{"$f":"IF(OR($C9=\"\",AB$7=\"\"),\"\",IF(AA9=\"\",Z9,INDEX(Shift_Codes,IF(MATCH(AA9,Shift_Codes,0)+1>COUNTA(Shift_Codes),1,MATCH(AA9,Shift_Codes,0)+1))))","v":""},{"$f":"IF(OR($C9=\"\",AC$7=\"\"),\"\",IF(AB9=\"\",AA9,INDEX(Shift_Codes,IF(MATCH(AB9,Shift_Codes,0)+1>COUNTA(Shift_Codes),1,MATCH(AB9,Shift_Codes,0)+1))))","v":""},{"$f":"IF(OR($C9=\"\",AD$7=\"\"),\"\",IF(AC9=\"\",AB9,INDEX(Shift_Codes,IF(MATCH(AC9,Shift_Codes,0)+1>COUNTA(Shift_Codes),1,MATCH(AC9,Shift_Codes,0)+1))))","v":""},{"$f":"IF(OR($C9=\"\",AE$7=\"\"),\"\",IF(AD9=\"\",AC9,INDEX(Shift_Codes,IF(MATCH(AD9,Shift_Codes,0)+1>COUNTA(Shift_Codes),1,MATCH(AD9,Shift_Codes,0)+1))))","v":""},{"$f":"IF(OR($C9=\"\",AF$7=\"\"),\"\",IF(AE9=\"\",AD9,INDEX(Shift_Codes,IF(MATCH(AE9,Shift_Codes,0)+1>COUNTA(Shift_Codes),1,MATCH(AE9,Shift_Codes,0)+1))))","v":""},{"$f":"IF(OR($C9=\"\",AG$7=\"\"),\"\",IF(AF9=\"\",AE9,INDEX(Shift_Codes,IF(MATCH(AF9,Shift_Codes,0)+1>COUNTA(Shift_Codes),1,MATCH(AF9,Shift_Codes,0)+1))))","v":""},{"$f":"IF(OR($C9=\"\",AH$7=\"\"),\"\",IF(AG9=\"\",AF9,INDEX(Shift_Codes,IF(MATCH(AG9,Shift_Codes,0)+1>COUNTA(Shift_Codes),1,MATCH(AG9,Shift_Codes,0)+1))))","v":""},{"$f":"IF(OR($C9=\"\",AI$7=\"\"),\"\",IF(AH9=\"\",AG9,INDEX(Shift_Codes,IF(MATCH(AH9,Shift_Codes,0)+1>COUNTA(Shift_Codes),1,MATCH(AH9,Shift_Codes,0)+1))))","v":""},null,{"$f":"COUNTIF($E9:$AI9,\"D*\")","v":0},{"$f":"COUNTIF($E9:$AI9,\"N*\")","v":0}]
[null,"Terry",null,null,{"$f":"IF(OR($C10=\"\",E$7=\"\"),\"\",IF(D10=\"\",C10,INDEX(Shift_Codes,IF(MATCH(D10,Shift_Codes,0)+1>COUNTA(Shift_Codes),1,MATCH(D10,Shift_Codes,0)+1))))","v":""},{"$f":"IF(OR($C10=\"\",F$7=\"\"),\"\",IF(E10=\"\",D10,INDEX(Shift_Codes,IF(MATCH(E10,Shift_Codes,0)+1>COUNTA(Shift_Codes),1,MATCH(E10,Shift_Codes,0)+1))))","v":""},{"$f":"IF(OR($C10=\"\",G$7=\"\"),\"\",IF(F10=\"\",E10,INDEX(Shift_Codes,IF(MATCH(F10,Shift_Codes,0)+1>COUNTA(Shift_Codes),1,MATCH(F10,Shift_Codes,0)+1))))","v":""},{"$f":"IF(OR($C10=\"\",H$7=\"\"),\"\",IF(G10=\"\",F10,INDEX(Shift_Codes,IF(MATCH(G10,Shift_Codes,0)+1>COUNTA(Shift_Codes),1,MATCH(G10,Shift_Codes,0)+1))))","v":""},{"$f":"IF(OR($C10=\"\",I$7=\"\"),\"\",IF(H10=\"\",G10,INDEX(Shift_Codes,IF(MATCH(H10,Shift_Codes,0)+1>COUNTA(Shift_Codes),1,MATCH(H10,Shift_Codes,0)+1))))","v":""},{"$f":"IF(OR($C10=\"\",J$7=\"\"),\"\",IF(I10=\"\",H10,INDEX(Shift_Codes,IF(MATCH(I10,Shift_Codes,0)+1>COUNTA(Shift_Codes),1,MATCH(I10,Shift_Codes,0)+1))))","v":""},{"$f":"IF(OR($C10=\"\",K$7=\"\"),\"\",IF(J10=\"\",I10,INDEX(Shift_Codes,IF(MATCH(J10,Shift_Codes,0)+1>COUNTA(Shift_Codes),1,MATCH(J10,Shift_Codes,0)+1))))","v":""},{"$f":"IF(OR($C10=\"\",L$7=\"\"),\"\",IF(K10=\"\",J10,INDEX(Shift_Codes,IF(MATCH(K10,Shift_Codes,0)+1>COUNTA(Shift_Codes),1,MATCH(K10,Shift_Codes,0)+1))))","v":""},{"$f":"IF(OR($C10=\"\",M$7=\"\"),\"\",IF(L10=\"\",K10,INDEX(Shift_Codes,IF(MATCH(L10,Shift_Codes,0)+1>COUNTA(Shift_Codes),1,MATCH(L10,Shift_Codes,0)+1))))","v":""},{"$f":"IF(OR($C10=\"\",N$7=\"\"),\"\",IF(M10=\"\",L10,INDEX(Shift_Codes,IF(MATCH(M10,Shift_Codes,0)+1>COUNTA(Shift_Codes),1,MATCH(M10,Shift_Codes,0)+1))))","v":""},{"$f":"IF(OR($C10=\"\",O$7=\"\"),\"\",IF(N10=\"\",M10,INDEX(Shift_Codes,IF(MATCH(N10,Shift_Codes,0)+1>COUNTA(Shift_Codes),1,MATCH(N10,Shift_Codes,0)+1))))","v":""},{"$f":"IF(OR($C10=\"\",P$7=\"\"),\"\",IF(O10=\"\",N10,INDEX(Shift_Codes,IF(MATCH(O10,Shift_Codes,0)+1>COUNTA(Shift_Codes),1,MATCH(O10,Shift_Codes,0)+1))))","v":""},{"$f":"IF(OR($C10=\"\",Q$7=\"\"),\"\",IF(P10=\"\",O10,INDEX(Shift_Codes,IF(MATCH(P10,Shift_Codes,0)+1>COUNTA(Shift_Codes),1,MATCH(P10,Shift_Codes,0)+1))))","v":""},{"$f":"IF(OR($C10=\"\",R$7=\"\"),\"\",IF(Q10=\"\",P10,INDEX(Shift_Codes,IF(MATCH(Q10,Shift_Codes,0)+1>COUNTA(Shift_Codes),1,MATCH(Q10,Shift_Codes,0)+1))))","v":""},{"$f":"IF(OR($C10=\"\",S$7=\"\"),\"\",IF(R10=\"\",Q10,INDEX(Shift_Codes,IF(MATCH(R10,Shift_Codes,0)+1>COUNTA(Shift_Codes),1,MATCH(R10,Shift_Codes,0)+1))))","v":""},{"$f":"IF(OR($C10=\"\",T$7=\"\"),\"\",IF(S10=\"\",R10,INDEX(Shift_Codes,IF(MATCH(S10,Shift_Codes,0)+1>COUNTA(Shift_Codes),1,MATCH(S10,Shift_Codes,0)+1))))","v":""},{"$f":"IF(OR($C10=\"\",U$7=\"\"),\"\",IF(T10=\"\",S10,INDEX(Shift_Codes,IF(MATCH(T10,Shift_Codes,0)+1>COUNTA(Shift_Codes),1,MATCH(T10,Shift_Codes,0)+1))))","v":""},{"$f":"IF(OR($C10=\"\",V$7=\"\"),\"\",IF(U10=\"\",T10,INDEX(Shift_Codes,IF(MATCH(U10,Shift_Codes,0)+1>COUNTA(Shift_Codes),1,MATCH(U10,Shift_Codes,0)+1))))","v":""},{"$f":"IF(OR($C10=\"\",W$7=\"\"),\"\",IF(V10=\"\",U10,INDEX(Shift_Codes,IF(MATCH(V10,Shift_Codes,0)+1>COUNTA(Shift_Codes),1,MATCH(V10,Shift_Codes,0)+1))))","v":""},{"$f":"IF(OR($C10=\"\",X$7=\"\"),\"\",IF(W10=\"\",V10,INDEX(Shift_Codes,IF(MATCH(W10,Shift_Codes,0)+1>COUNTA(Shift_Codes),1,MATCH(W10,Shift_Codes,0)+1))))","v":""},{"$f":"IF(OR($C10=\"\",Y$7=\"\"),\"\",IF(X10=\"\",W10,INDEX(Shift_Codes,IF(MATCH(X10,Shift_Codes,0)+1>COUNTA(Shift_Codes),1,MATCH(X10,Shift_Codes,0)+1))))","v":""},{"$f":"IF(OR($C10=\"\",Z$7=\"\"),\"\",IF(Y10=\"\",X10,INDEX(Shift_Codes,IF(MATCH(Y10,Shift_Codes,0)+1>COUNTA(Shift_Codes),1,MATCH(Y10,Shift_Codes,0)+1))))","v":""},{"$f":"IF(OR($C10=\"\",AA$7=\"\"),\"\",IF(Z10=\"\",Y10,INDEX(Shift_Codes,IF(MATCH(Z10,Shift_Codes,0)+1>COUNTA(Shift_Codes),1,MATCH(Z10,Shift_Codes,0)+1))))","v":""},{"$f":"IF(OR($C10=\"\",AB$7=\"\"),\"\",IF(AA10=\"\",Z10,INDEX(Shift_Codes,IF(MATCH(AA10,Shift_Codes,0)+1>COUNTA(Shift_Codes),1,MATCH(AA10,Shift_Codes,0)+1))))","v":""},{"$f":"IF(OR($C10=\"\",AC$7=\"\"),\"\",IF(AB10=\"\",AA10,INDEX(Shift_Codes,IF(MATCH(AB10,Shift_Codes,0)+1>COUNTA(Shift_Codes),1,MATCH(AB10,Shift_Codes,0)+1))))","v":""},{"$f":"IF(OR($C10=\"\",AD$7=\"\"),\"\",IF(AC10=\"\",AB10,INDEX(Shift_Codes,IF(MATCH(AC10,Shift_Codes,0)+1>COUNTA(Shift_Codes),1,MATCH(AC10,Shift_Codes,0)+1))))","v":""},{"$f":"IF(OR($C10=\"\",AE$7=\"\"),\"\",IF(AD10=\"\",AC10,INDEX(Shift_Codes,IF(MATCH(AD10,Shift_Codes,0)+1>COUNTA(Shift_Codes),1,MATCH(AD10,Shift_Codes,0)+1))))","v":""},{"$f":"IF(OR($C10=\"\",AF$7=\"\"),\"\",IF(AE10=\"\",AD10,INDEX(Shift_Codes,IF(MATCH(AE10,Shift_Codes,0)+1>COUNTA(Shift_Codes),1,MATCH(AE10,Shift_Codes,0)+1))))","v":""},{"$f":"IF(OR($C10=\"\",AG$7=\"\"),\"\",IF(AF10=\"\",AE10,INDEX(Shift_Codes,IF(MATCH(AF10,Shift_Codes,0)+1>COUNTA(Shift_Codes),1,MATCH(AF10,Shift_Codes,0)+1))))","v":""},{"$f":"IF(OR($C10=\"\",AH$7=\"\"),\"\",IF(AG10=\"\",AF10,INDEX(Shift_Codes,IF(MATCH(AG10,Shift_Codes,0)+1>COUNTA(Shift_Codes),1,MATCH(AG10,Shift_Codes,0)+1))))","v":""},{"$f":"IF(OR($C10=\"\",AI$7=\"\"),\"\",IF(AH10=\"\",AG10,INDEX(Shift_Codes,IF(MATCH(AH10,Shift_Codes,0)+1>COUNTA(Shift_Codes),1,MATCH(AH10,Shift_Codes,0)+1))))","v":""},null,0,0]
[null,null,null,null,{"$f":"IF(OR($C11=\"\",E$7=\"\"),\"\",IF(D11=\"\",C11,INDEX(Shift_Codes,IF(MATCH(D11,Shift_Codes,0)+1>COUNTA(Shift_Codes),1,MATCH(D11,Shift_Codes,0)+1))))","v":""},{"$f":"IF(OR($C11=\"\",F$7=\"\"),\"\",IF(E11=\"\",D11,INDEX(Shift_Codes,IF(MATCH(E11,Shift_Codes,0)+1>COUNTA(Shift_Codes),1,MATCH(E11,Shift_Codes,0)+1))))","v":""},{"$f":"IF(OR($C11=\"\",G$7=\"\"),\"\",IF(F11=\"\",E11,INDEX(Shift_Codes,IF(MATCH(F11,Shift_Codes,0)+1>COUNTA(Shift_Codes),1,MATCH(F11,Shift_Codes,0)+1))))","v":""},{"$f":"IF(OR($C11=\"\",H$7=\"\"),\"\",IF(G11=\"\",F11,INDEX(Shift_Codes,IF(MATCH(G11,Shift_Codes,0)+1>COUNTA(Shift_Codes),1,MATCH(G11,Shift_Codes,0)+1))))","v":""},{"$f":"IF(OR($C11=\"\",I$7=\"\"),\"\",IF(H11=\"\",G11,INDEX(Shift_Codes,IF(MATCH(H11,Shift_Codes,0)+1>COUNTA(Shift_Codes),1,MATCH(H11,Shift_Codes,0)+1))))","v":""},{"$f":"IF(OR($C11=\"\",J$7=\"\"),\"\",IF(I11=\"\",H11,INDEX(Shift_Codes,IF(MATCH(I11,Shift_Codes,0)+1>COUNTA(Shift_Codes),1,MATCH(I11,Shift_Codes,0)+1))))","v":""},{"$f":"IF(OR($C11=\"\",K$7=\"\"),\"\",IF(J11=\"\",I11,INDEX(Shift_Codes,IF(MATCH(J11,Shift_Codes,0)+1>COUNTA(Shift_Codes),1,MATCH(J11,Shift_Codes,0)+1))))","v":""},{"$f":"IF(OR($C11=\"\",L$7=\"\"),\"\",IF(K11=\"\",J11,INDEX(Shift_Codes,IF(MATCH(K11,Shift_Codes,0)+1>COUNTA(Shift_Codes),1,MATCH(K11,Shift_Codes,0)+1))))","v":""},{"$f":"IF(OR($C11=\"\",M$7=\"\"),\"\",IF(L11=\"\",K11,INDEX(Shift_Codes,IF(MATCH(L11,Shift_Codes,0)+1>COUNTA(Shift_Codes),1,MATCH(L11,Shift_Codes,0)+1))))","v":""},{"$f":"IF(OR($C11=\"\",N$7=\"\"),\"\",IF(M11=\"\",L11,INDEX(Shift_Codes,IF(MATCH(M11,Shift_Codes,0)+1>COUNTA(Shift_Codes),1,MATCH(M11,Shift_Codes,0)+1))))","v":""},{"$f":"IF(OR($C11=\"\",O$7=\"\"),\"\",IF(N11=\"\",M11,INDEX(Shift_Codes,IF(MATCH(N11,Shift_Codes,0)+1>COUNTA(Shift_Codes),1,MATCH(N11,Shift_Codes,0)+1))))","v":""},{"$f":"IF(OR($C11=\"\",P$7=\"\"),\"\",IF(O11=\"\",N11,INDEX(Shift_Codes,IF(MATCH(O11,Shift_Codes,0)+1>COUNTA(Shift_Codes),1,MATCH(O11,Shift_Codes,0)+1))))","v":""},{"$f":"IF(OR($C11=\"\",Q$7=\"\"),\"\",IF(P11=\"\",O11,INDEX(Shift_Codes,IF(MATCH(P11,Shift_Codes,0)+1>COUNTA(Shift_Codes),1,MATCH(P11,Shift_Codes,0)+1))))","v":""},{"$f":"IF(OR($C11=\"\",R$7=\"\"),\"\",IF(Q11=\"\",P11,INDEX(Shift_Codes,IF(MATCH(Q11,Shift_Codes,0)+1>COUNTA(Shift_Codes),1,MATCH(Q11,Shift_Codes,0)+1))))","v":""},{"$f":"IF(OR($C11=\"\",S$7=\"\"),\"\",IF(R11=\"\",Q11,INDEX(Shift_Codes,IF(MATCH(R11,Shift_Codes,0)+1>COUNTA(Shift_Codes),1,MATCH(R11,Shift_Codes,0)+1))))","v":""},{"$f":"IF(OR($C11=\"\",T$7=\"\"),\"\",IF(S11=\"\",R11,INDEX(Shift_Codes,IF(MATCH(S11,Shift_Codes,0)+1>COUNTA(Shift_Codes),1,MATCH(S11,Shift_Codes,0)+1))))","v":""},{"$f":"IF(OR($C11=\"\",U$7=\"\"),\"\",IF(T11=\"\",S11,INDEX(Shift_Codes,IF(MATCH(T11,Shift_Codes,0)+1>COUNTA(Shift_Codes),1,MATCH(T11,Shift_Codes,0)+1))))","v":""},{"$f":"IF(OR($C11=\"\",V$7=\"\"),\"\",IF(U11=\"\",T11,INDEX(Shift_Codes,IF(MATCH(U11,Shift_Codes,0)+1>COUNTA(Shift_Codes),1,MATCH(U11,Shift_Codes,0)+1))))","v":""},{"$f":"IF(OR($C11=\"\",W$7=\"\"),\"\",IF(V11=\"\",U11,INDEX(Shift_Codes,IF(MATCH(V11,Shift_Codes,0)+1>COUNTA(Shift_Codes),1,MATCH(V11,Shift_Codes,0)+1))))","v":""},{"$f":"IF(OR($C11=\"\",X$7=\"\"),\"\",IF(W11=\"\",V11,INDEX(Shift_Codes,IF(MATCH(W11,Shift_Codes,0)+1>COUNTA(Shift_Codes),1,MATCH(W11,Shift_Codes,0)+1))))","v":""},{"$f":"IF(OR($C11=\"\",Y$7=\"\"),\"\",IF(X11=\"\",W11,INDEX(Shift_Codes,IF(MATCH(X11,Shift_Codes,0)+1>COUNTA(Shift_Codes),1,MATCH(X11,Shift_Codes,0)+1))))","v":""},{"$f":"IF(OR($C11=\"\",Z$7=\"\"),\"\",IF(Y11=\"\",X11,INDEX(Shift_Codes,IF(MATCH(Y11,Shift_Codes,0)+1>COUNTA(Shift_Codes),1,MATCH(Y11,Shift_Codes,0)+1))))","v":""},{"$f":"IF(OR($C11=\"\",AA$7=\"\"),\"\",IF(Z11=\"\",Y11,INDEX(Shift_Codes,IF(MATCH(Z11,Shift_Codes,0)+1>COUNTA(Shift_Codes),1,MATCH(Z11,Shift_Codes,0)+1))))","v":""},{"$f":"IF(OR($C11=\"\",AB$7=\"\"),\"\",IF(AA11=\"\",Z11,INDEX(Shift_Codes,IF(MATCH(AA11,Shift_Codes,0)+1>COUNTA(Shift_Codes),1,MATCH(AA11,Shift_Codes,0)+1))))","v":""},{"$f":"IF(OR($C11=\"\",AC$7=\"\"),\"\",IF(AB11=\"\",AA11,INDEX(Shift_Codes,IF(MATCH(AB11,Shift_Codes,0)+1>COUNTA(Shift_Codes),1,MATCH(AB11,Shift_Codes,0)+1))))","v":""},{"$f":"IF(OR($C11=\"\",AD$7=\"\"),\"\",IF(AC11=\"\",AB11,INDEX(Shift_Codes,IF(MATCH(AC11,Shift_Codes,0)+1>COUNTA(Shift_Codes),1,MATCH(AC11,Shift_Codes,0)+1))))","v":""},{"$f":"IF(OR($C11=\"\",AE$7=\"\"),\"\",IF(AD11=\"\",AC11,INDEX(Shift_Codes,IF(MATCH(AD11,Shift_Codes,0)+1>COUNTA(Shift_Codes),1,MATCH(AD11,Shift_Codes,0)+1))))","v":""},{"$f":"IF(OR($C11=\"\",AF$7=\"\"),\"\",IF(AE11=\"\",AD11,INDEX(Shift_Codes,IF(MATCH(AE11,Shift_Codes,0)+1>COUNTA(Shift_Codes),1,MATCH(AE11,Shift_Codes,0)+1))))","v":""},{"$f":"IF(OR($C11=\"\",AG$7=\"\"),\"\",IF(AF11=\"\",AE11,INDEX(Shift_Codes,IF(MATCH(AF11,Shift_Codes,0)+1>COUNTA(Shift_Codes),1,MATCH(AF11,Shift_Codes,0)+1))))","v":""},{"$f":"IF(OR($C11=\"\",AH$7=\"\"),\"\",IF(AG11=\"\",AF11,INDEX(Shift_Codes,IF(MATCH(AG11,Shift_Codes,0)+1>COUNTA(Shift_Codes),1,MATCH(AG11,Shift_Codes,0)+1))))","v":""},{"$f":"IF(OR($C11=\"\",AI$7=\"\"),\"\",IF(AH11=\"\",AG11,INDEX(Shift_Codes,IF(MATCH(AH11,Shift_Codes,0)+1>COUNTA(Shift_Codes),1,MATCH(AH11,Shift_Codes,0)+1))))","v":""},null,0,0]
[null,null,null,null,{"$f":"IF(OR($C12=\"\",E$7=\"\"),\"\",IF(D12=\"\",C12,INDEX(Shift_Codes,IF(MATCH(D12,Shift_Codes,0)+1>COUNTA(Shift_Codes),1,MATCH(D12,Shift_Codes,0)+1))))","v":""},{"$f":"IF(OR($C12=\"\",F$7=\"\"),\"\",IF(E12=\"\",D12,INDEX(Shift_Codes,IF(MATCH(E12,Shift_Codes,0)+1>COUNTA(Shift_Codes),1,MATCH(E12,Shift_Codes,0)+1))))","v":""},{"$f":"IF(OR($C12=\"\",G$7=\"\"),\"\",IF(F12=\"\",E12,INDEX(Shift_Codes,IF(MATCH(F12,Shift_Codes,0)+1>COUNTA(Shift_Codes),1,MATCH(F12,Shift_Codes,0)+1))))","v":""},{"$f":"IF(OR($C12=\"\",H$7=\"\"),\"\",IF(G12=\"\",F12,INDEX(Shift_Codes,IF(MATCH(G12,Shift_Codes,0)+1>COUNTA(Shift_Codes),1,MATCH(G12,Shift_Codes,0)+1))))","v":""},{"$f":"IF(OR($C12=\"\",I$7=\"\"),\"\",IF(H12=\"\",G12,INDEX(Shift_Codes,IF(MATCH(H12,Shift_Codes,0)+1>COUNTA(Shift_Codes),1,MATCH(H12,Shift_Codes,0)+1))))","v":""},{"$f":"IF(OR($C12=\"\",J$7=\"\"),\"\",IF(I12=\"\",H12,INDEX(Shift_Codes,IF(MATCH(I12,Shift_Codes,0)+1>COUNTA(Shift_Codes),1,MATCH(I12,Shift_Codes,0)+1))))","v":""},{"$f":"IF(OR($C12=\"\",K$7=\"\"),\"\",IF(J12=\"\",I12,INDEX(Shift_Codes,IF(MATCH(J12,Shift_Codes,0)+1>COUNTA(Shift_Codes),1,MATCH(J12,Shift_Codes,0)+1))))","v":""},{"$f":"IF(OR($C12=\"\",L$7=\"\"),\"\",IF(K12=\"\",J12,INDEX(Shift_Codes,IF(MATCH(K12,Shift_Codes,0)+1>COUNTA(Shift_Codes),1,MATCH(K12,Shift_Codes,0)+1))))","v":""},{"$f":"IF(OR($C12=\"\",M$7=\"\"),\"\",IF(L12=\"\",K12,INDEX(Shift_Codes,IF(MATCH(L12,Shift_Codes,0)+1>COUNTA(Shift_Codes),1,MATCH(L12,Shift_Codes,0)+1))))","v":""},{"$f":"IF(OR($C12=\"\",N$7=\"\"),\"\",IF(M12=\"\",L12,INDEX(Shift_Codes,IF(MATCH(M12,Shift_Codes,0)+1>COUNTA(Shift_Codes),1,MATCH(M12,Shift_Codes,0)+1))))","v":""},{"$f":"IF(OR($C12=\"\",O$7=\"\"),\"\",IF(N12=\"\",M12,INDEX(Shift_Codes,IF(MATCH(N12,Shift_Codes,0)+1>COUNTA(Shift_Codes),1,MATCH(N12,Shift_Codes,0)+1))))","v":""},{"$f":"IF(OR($C12=\"\",P$7=\"\"),\"\",IF(O12=\"\",N12,INDEX(Shift_Codes,IF(MATCH(O12,Shift_Codes,0)+1>COUNTA(Shift_Codes),1,MATCH(O12,Shift_Codes,0)+1))))","v":""},{"$f":"IF(OR($C12=\"\",Q$7=\"\"),\"\",IF(P12=\"\",O12,INDEX(Shift_Codes,IF(MATCH(P12,Shift_Codes,0)+1>COUNTA(Shift_Codes),1,MATCH(P12,Shift_Codes,0)+1))))","v":""},{"$f":"IF(OR($C12=\"\",R$7=\"\"),\"\",IF(Q12=\"\",P12,INDEX(Shift_Codes,IF(MATCH(Q12,Shift_Codes,0)+1>COUNTA(Shift_Codes),1,MATCH(Q12,Shift_Codes,0)+1))))","v":""},{"$f":"IF(OR($C12=\"\",S$7=\"\"),\"\",IF(R12=\"\",Q12,INDEX(Shift_Codes,IF(MATCH(R12,Shift_Codes,0)+1>COUNTA(Shift_Codes),1,MATCH(R12,Shift_Codes,0)+1))))","v":""},{"$f":"IF(OR($C12=\"\",T$7=\"\"),\"\",IF(S12=\"\",R12,INDEX(Shift_Codes,IF(MATCH(S12,Shift_Codes,0)+1>COUNTA(Shift_Codes),1,MATCH(S12,Shift_Codes,0)+1))))","v":""},{"$f":"IF(OR($C12=\"\",U$7=\"\"),\"\",IF(T12=\"\",S12,INDEX(Shift_Codes,IF(MATCH(T12,Shift_Codes,0)+1>COUNTA(Shift_Codes),1,MATCH(T12,Shift_Codes,0)+1))))","v":""},{"$f":"IF(OR($C12=\"\",V$7=\"\"),\"\",IF(U12=\"\",T12,INDEX(Shift_Codes,IF(MATCH(U12,Shift_Codes,0)+1>COUNTA(Shift_Codes),1,MATCH(U12,Shift_Codes,0)+1))))","v":""},{"$f":"IF(OR($C12=\"\",W$7=\"\"),\"\",IF(V12=\"\",U12,INDEX(Shift_Codes,IF(MATCH(V12,Shift_Codes,0)+1>COUNTA(Shift_Codes),1,MATCH(V12,Shift_Codes,0)+1))))","v":""},{"$f":"IF(OR($C12=\"\",X$7=\"\"),\"\",IF(W12=\"\",V12,INDEX(Shift_Codes,IF(MATCH(W12,Shift_Codes,0)+1>COUNTA(Shift_Codes),1,MATCH(W12,Shift_Codes,0)+1))))","v":""},{"$f":"IF(OR($C12=\"\",Y$7=\"\"),\"\",IF(X12=\"\",W12,INDEX(Shift_Codes,IF(MATCH(X12,Shift_Codes,0)+1>COUNTA(Shift_Codes),1,MATCH(X12,Shift_Codes,0)+1))))","v":""},{"$f":"IF(OR($C12=\"\",Z$7=\"\"),\"\",IF(Y12=\"\",X12,INDEX(Shift_Codes,IF(MATCH(Y12,Shift_Codes,0)+1>COUNTA(Shift_Codes),1,MATCH(Y12,Shift_Codes,0)+1))))","v":""},{"$f":"IF(OR($C12=\"\",AA$7=\"\"),\"\",IF(Z12=\"\",Y12,INDEX(Shift_Codes,IF(MATCH(Z12,Shift_Codes,0)+1>COUNTA(Shift_Codes),1,MATCH(Z12,Shift_Codes,0)+1))))","v":""},{"$f":"IF(OR($C12=\"\",AB$7=\"\"),\"\",IF(AA12=\"\",Z12,INDEX(Shift_Codes,IF(MATCH(AA12,Shift_Codes,0)+1>COUNTA(Shift_Codes),1,MATCH(AA12,Shift_Codes,0)+1))))","v":""},{"$f":"IF(OR($C12=\"\",AC$7=\"\"),\"\",IF(AB12=\"\",AA12,INDEX(Shift_Codes,IF(MATCH(AB12,Shift_Codes,0)+1>COUNTA(Shift_Codes),1,MATCH(AB12,Shift_Codes,0)+1))))","v":""},{"$f":"IF(OR($C12=\"\",AD$7=\"\"),\"\",IF(AC12=\"\",AB12,INDEX(Shift_Codes,IF(MATCH(AC12,Shift_Codes,0)+1>COUNTA(Shift_Codes),1,MATCH(AC12,Shift_Codes,0)+1))))","v":""},{"$f":"IF(OR($C12=\"\",AE$7=\"\"),\"\",IF(AD12=\"\",AC12,INDEX(Shift_Codes,IF(MATCH(AD12,Shift_Codes,0)+1>COUNTA(Shift_Codes),1,MATCH(AD12,Shift_Codes,0)+1))))","v":""},{"$f":"IF(OR($C12=\"\",AF$7=\"\"),\"\",IF(AE12=\"\",AD12,INDEX(Shift_Codes,IF(MATCH(AE12,Shift_Codes,0)+1>COUNTA(Shift_Codes),1,MATCH(AE12,Shift_Codes,0)+1))))","v":""},{"$f":"IF(OR($C12=\"\",AG$7=\"\"),\"\",IF(AF12=\"\",AE12,INDEX(Shift_Codes,IF(MATCH(AF12,Shift_Codes,0)+1>COUNTA(Shift_Codes),1,MATCH(AF12,Shift_Codes,0)+1))))","v":""},{"$f":"IF(OR($C12=\"\",AH$7=\"\"),\"\",IF(AG12=\"\",AF12,INDEX(Shift_Codes,IF(MATCH(AG12,Shift_Codes,0)+1>COUNTA(Shift_Codes),1,MATCH(AG12,Shift_Codes,0)+1))))","v":""},{"$f":"IF(OR($C12=\"\",AI$7=\"\"),\"\",IF(AH12=\"\",AG12,INDEX(Shift_Codes,IF(MATCH(AH12,Shift_Codes,0)+1>COUNTA(Shift_Codes),1,MATCH(AH12,Shift_Codes,0)+1))))","v":""},null,0,0]
[null,null,null,null,{"$f":"IF(OR($C13=\"\",E$7=\"\"),\"\",IF(D13=\"\",C13,INDEX(Shift_Codes,IF(MATCH(D13,Shift_Codes,0)+1>COUNTA(Shift_Codes),1,MATCH(D13,Shift_Codes,0)+1))))","v":""},{"$f":"IF(OR($C13=\"\",F$7=\"\"),\"\",IF(E13=\"\",D13,INDEX(Shift_Codes,IF(MATCH(E13,Shift_Codes,0)+1>COUNTA(Shift_Codes),1,MATCH(E13,Shift_Codes,0)+1))))","v":""},{"$f":"IF(OR($C13=\"\",G$7=\"\"),\"\",IF(F13=\"\",E13,INDEX(Shift_Codes,IF(MATCH(F13,Shift_Codes,0)+1>COUNTA(Shift_Codes),1,MATCH(F13,Shift_Codes,0)+1))))","v":""},{"$f":"IF(OR($C13=\"\",H$7=\"\"),\"\",IF(G13=\"\",F13,INDEX(Shift_Codes,IF(MATCH(G13,Shift_Codes,0)+1>COUNTA(Shift_Codes),1,MATCH(G13,Shift_Codes,0)+1))))","v":""},{"$f":"IF(OR($C13=\"\",I$7=\"\"),\"\",IF(H13=\"\",G13,INDEX(Shift_Codes,IF(MATCH(H13,Shift_Codes,0)+1>COUNTA(Shift_Codes),1,MATCH(H13,Shift_Codes,0)+1))))","v":""},{"$f":"IF(OR($C13=\"\",J$7=\"\"),\"\",IF(I13=\"\",H13,INDEX(Shift_Codes,IF(MATCH(I13,Shift_Codes,0)+1>COUNTA(Shift_Codes),1,MATCH(I13,Shift_Codes,0)+1))))","v":""},{"$f":"IF(OR($C13=\"\",K$7=\"\"),\"\",IF(J13=\"\",I13,INDEX(Shift_Codes,IF(MATCH(J13,Shift_Codes,0)+1>COUNTA(Shift_Codes),1,MATCH(J13,Shift_Codes,0)+1))))","v":""},{"$f":"IF(OR($C13=\"\",L$7=\"\"),\"\",IF(K13=\"\",J13,INDEX(Shift_Codes,IF(MATCH(K13,Shift_Codes,0)+1>COUNTA(Shift_Codes),1,MATCH(K13,Shift_Codes,0)+1))))","v":""},{"$f":"IF(OR($C13=\"\",M$7=\"\"),\"\",IF(L13=\"\",K13,INDEX(Shift_Codes,IF(MATCH(L13,Shift_Codes,0)+1>COUNTA(Shift_Codes),1,MATCH(L13,Shift_Codes,0)+1))))","v":""},{"$f":"IF(OR($C13=\"\",N$7=\"\"),\"\",IF(M13=\"\",L13,INDEX(Shift_Codes,IF(MATCH(M13,Shift_Codes,0)+1>COUNTA(Shift_Codes),1,MATCH(M13,Shift_Codes,0)+1))))","v":""},{"$f":"IF(OR($C13=\"\",O$7=\"\"),\"\",IF(N13=\"\",M13,INDEX(Shift_Codes,IF(MATCH(N13,Shift_Codes,0)+1>COUNTA(Shift_Codes),1,MATCH(N13,Shift_Codes,0)+1))))","v":""},{"$f":"IF(OR($C13=\"\",P$7=\"\"),\"\",IF(O13=\"\",N13,INDEX(Shift_Codes,IF(MATCH(O13,Shift_Codes,0)+1>COUNTA(Shift_Codes),1,MATCH(O13,Shift_Codes,0)+1))))","v":""},{"$f":"IF(OR($C13=\"\",Q$7=\"\"),\"\",IF(P13=\"\",O13,INDEX(Shift_Codes,IF(MATCH(P13,Shift_Codes,0)+1>COUNTA(Shift_Codes),1,MATCH(P13,Shift_Codes,0)+1))))","v":""},{"$f":"IF(OR($C13=\"\",R$7=\"\"),\"\",IF(Q13=\"\",P13,INDEX(Shift_Codes,IF(MATCH(Q13,Shift_Codes,0)+1>COUNTA(Shift_Codes),1,MATCH(Q13,Shift_Codes,0)+1))))","v":""},{"$f":"IF(OR($C13=\"\",S$7=\"\"),\"\",IF(R13=\"\",Q13,INDEX(Shift_Codes,IF(MATCH(R13,Shift_Codes,0)+1>COUNTA(Shift_Codes),1,MATCH(R13,Shift_Codes,0)+1))))","v":""},{"$f":"IF(OR($C13=\"\",T$7=\"\"),\"\",IF(S13=\"\",R13,INDEX(Shift_Codes,IF(MATCH(S13,Shift_Codes,0)+1>COUNTA(Shift_Codes),1,MATCH(S13,Shift_Codes,0)+1))))","v":""},{"$f":"IF(OR($C13=\"\",U$7=\"\"),\"\",IF(T13=\"\",S13,INDEX(Shift_Codes,IF(MATCH(T13,Shift_Codes,0)+1>COUNTA(Shift_Codes),1,MATCH(T13,Shift_Codes,0)+1))))","v":""},{"$f":"IF(OR($C13=\"\",V$7=\"\"),\"\",IF(U13=\"\",T13,INDEX(Shift_Codes,IF(MATCH(U13,Shift_Codes,0)+1>COUNTA(Shift_Codes),1,MATCH(U13,Shift_Codes,0)+1))))","v":""},{"$f":"IF(OR($C13=\"\",W$7=\"\"),\"\",IF(V13=\"\",U13,INDEX(Shift_Codes,IF(MATCH(V13,Shift_Codes,0)+1>COUNTA(Shift_Codes),1,MATCH(V13,Shift_Codes,0)+1))))","v":""},{"$f":"IF(OR($C13=\"\",X$7=\"\"),\"\",IF(W13=\"\",V13,INDEX(Shift_Codes,IF(MATCH(W13,Shift_Codes,0)+1>COUNTA(Shift_Codes),1,MATCH(W13,Shift_Codes,0)+1))))","v":""},{"$f":"IF(OR($C13=\"\",Y$7=\"\"),\"\",IF(X13=\"\",W13,INDEX(Shift_Codes,IF(MATCH(X13,Shift_Codes,0)+1>COUNTA(Shift_Codes),1,MATCH(X13,Shift_Codes,0)+1))))","v":""},{"$f":"IF(OR($C13=\"\",Z$7=\"\"),\"\",IF(Y13=\"\",X13,INDEX(Shift_Codes,IF(MATCH(Y13,Shift_Codes,0)+1>COUNTA(Shift_Codes),1,MATCH(Y13,Shift_Codes,0)+1))))","v":""},{"$f":"IF(OR($C13=\"\",AA$7=\"\"),\"\",IF(Z13=\"\",Y13,INDEX(Shift_Codes,IF(MATCH(Z13,Shift_Codes,0)+1>COUNTA(Shift_Codes),1,MATCH(Z13,Shift_Codes,0)+1))))","v":""},{"$f":"IF(OR($C13=\"\",AB$7=\"\"),\"\",IF(AA13=\"\",Z13,INDEX(Shift_Codes,IF(MATCH(AA13,Shift_Codes,0)+1>COUNTA(Shift_Codes),1,MATCH(AA13,Shift_Codes,0)+1))))","v":""},{"$f":"IF(OR($C13=\"\",AC$7=\"\"),\"\",IF(AB13=\"\",AA13,INDEX(Shift_Codes,IF(MATCH(AB13,Shift_Codes,0)+1>COUNTA(Shift_Codes),1,MATCH(AB13,Shift_Codes,0)+1))))","v":""},{"$f":"IF(OR($C13=\"\",AD$7=\"\"),\"\",IF(AC13=\"\",AB13,INDEX(Shift_Codes,IF(MATCH(AC13,Shift_Codes,0)+1>COUNTA(Shift_Codes),1,MATCH(AC13,Shift_Codes,0)+1))))","v":""},{"$f":"IF(OR($C13=\"\",AE$7=\"\"),\"\",IF(AD13=\"\",AC13,INDEX(Shift_Codes,IF(MATCH(AD13,Shift_Codes,0)+1>COUNTA(Shift_Codes),1,MATCH(AD13,Shift_Codes,0)+1))))","v":""},{"$f":"IF(OR($C13=\"\",AF$7=\"\"),\"\",IF(AE13=\"\",AD13,INDEX(Shift_Codes,IF(MATCH(AE13,Shift_Codes,0)+1>COUNTA(Shift_Codes),1,MATCH(AE13,Shift_Codes,0)+1))))","v":""},{"$f":"IF(OR($C13=\"\",AG$7=\"\"),\"\",IF(AF13=\"\",AE13,INDEX(Shift_Codes,IF(MATCH(AF13,Shift_Codes,0)+1>COUNTA(Shift_Codes),1,MATCH(AF13,Shift_Codes,0)+1))))","v":""},{"$f":"IF(OR($C13=\"\",AH$7=\"\"),\"\",IF(AG13=\"\",AF13,INDEX(Shift_Codes,IF(MATCH(AG13,Shift_Codes,0)+1>COUNTA(Shift_Codes),1,MATCH(AG13,Shift_Codes,0)+1))))","v":""},{"$f":"IF(OR($C13=\"\",AI$7=\"\"),\"\",IF(AH13=\"\",AG13,INDEX(Shift_Codes,IF(MATCH(AH13,Shift_Codes,0)+1>COUNTA(Shift_Codes),1,MATCH(AH13,Shift_Codes,0)+1))))","v":""},null,0,0]
[null,null,null,null,{"$f":"IF(OR($C14=\"\",E$7=\"\"),\"\",IF(D14=\"\",C14,INDEX(Shift_Codes,IF(MATCH(D14,Shift_Codes,0)+1>COUNTA(Shift_Codes),1,MATCH(D14,Shift_Codes,0)+1))))","v":""},{"$f":"IF(OR($C14=\"\",F$7=\"\"),\"\",IF(E14=\"\",D14,INDEX(Shift_Codes,IF(MATCH(E14,Shift_Codes,0)+1>COUNTA(Shift_Codes),1,MATCH(E14,Shift_Codes,0)+1))))","v":""},{"$f":"IF(OR($C14=\"\",G$7=\"\"),\"\",IF(F14=\"\",E14,INDEX(Shift_Codes,IF(MATCH(F14,Shift_Codes,0)+1>COUNTA(Shift_Codes),1,MATCH(F14,Shift_Codes,0)+1))))","v":""},{"$f":"IF(OR($C14=\"\",H$7=\"\"),\"\",IF(G14=\"\",F14,INDEX(Shift_Codes,IF(MATCH(G14,Shift_Codes,0)+1>COUNTA(Shift_Codes),1,MATCH(G14,Shift_Codes,0)+1))))","v":""},{"$f":"IF(OR($C14=\"\",I$7=\"\"),\"\",IF(H14=\"\",G14,INDEX(Shift_Codes,IF(MATCH(H14,Shift_Codes,0)+1>COUNTA(Shift_Codes),1,MATCH(H14,Shift_Codes,0)+1))))","v":""},{"$f":"IF(OR($C14=\"\",J$7=\"\"),\"\",IF(I14=\"\",H14,INDEX(Shift_Codes,IF(MATCH(I14,Shift_Codes,0)+1>COUNTA(Shift_Codes),1,MATCH(I14,Shift_Codes,0)+1))))","v":""},{"$f":"IF(OR($C14=\"\",K$7=\"\"),\"\",IF(J14=\"\",I14,INDEX(Shift_Codes,IF(MATCH(J14,Shift_Codes,0)+1>COUNTA(Shift_Codes),1,MATCH(J14,Shift_Codes,0)+1))))","v":""},{"$f":"IF(OR($C14=\"\",L$7=\"\"),\"\",IF(K14=\"\",J14,INDEX(Shift_Codes,IF(MATCH(K14,Shift_Codes,0)+1>COUNTA(Shift_Codes),1,MATCH(K14,Shift_Codes,0)+1))))","v":""},{"$f":"IF(OR($C14=\"\",M$7=\"\"),\"\",IF(L14=\"\",K14,INDEX(Shift_Codes,IF(MATCH(L14,Shift_Codes,0)+1>COUNTA(Shift_Codes),1,MATCH(L14,Shift_Codes,0)+1))))","v":""},{"$f":"IF(OR($C14=\"\",N$7=\"\"),\"\",IF(M14=\"\",L14,INDEX(Shift_Codes,IF(MATCH(M14,Shift_Codes,0)+1>COUNTA(Shift_Codes),1,MATCH(M14,Shift_Codes,0)+1))))","v":""},{"$f":"IF(OR($C14=\"\",O$7=\"\"),\"\",IF(N14=\"\",M14,INDEX(Shift_Codes,IF(MATCH(N14,Shift_Codes,0)+1>COUNTA(Shift_Codes),1,MATCH(N14,Shift_Codes,0)+1))))","v":""},{"$f":"IF(OR($C14=\"\",P$7=\"\"),\"\",IF(O14=\"\",N14,INDEX(Shift_Codes,IF(MATCH(O14,Shift_Codes,0)+1>COUNTA(Shift_Codes),1,MATCH(O14,Shift_Codes,0)+1))))","v":""},{"$f":"IF(OR($C14=\"\",Q$7=\"\"),\"\",IF(P14=\"\",O14,INDEX(Shift_Codes,IF(MATCH(P14,Shift_Codes,0)+1>COUNTA(Shift_Codes),1,MATCH(P14,Shift_Codes,0)+1))))","v":""},{"$f":"IF(OR($C14=\"\",R$7=\"\"),\"\",IF(Q14=\"\",P14,INDEX(Shift_Codes,IF(MATCH(Q14,Shift_Codes,0)+1>COUNTA(Shift_Codes),1,MATCH(Q14,Shift_Codes,0)+1))))","v":""},{"$f":"IF(OR($C14=\"\",S$7=\"\"),\"\",IF(R14=\"\",Q14,INDEX(Shift_Codes,IF(MATCH(R14,Shift_Codes,0)+1>COUNTA(Shift_Codes),1,MATCH(R14,Shift_Codes,0)+1))))","v":""},{"$f":"IF(OR($C14=\"\",T$7=\"\"),\"\",IF(S14=\"\",R14,INDEX(Shift_Codes,IF(MATCH(S14,Shift_Codes,0)+1>COUNTA(Shift_Codes),1,MATCH(S14,Shift_Codes,0)+1))))","v":""},{"$f":"IF(OR($C14=\"\",U$7=\"\"),\"\",IF(T14=\"\",S14,INDEX(Shift_Codes,IF(MATCH(T14,Shift_Codes,0)+1>COUNTA(Shift_Codes),1,MATCH(T14,Shift_Codes,0)+1))))","v":""},{"$f":"IF(OR($C14=\"\",V$7=\"\"),\"\",IF(U14=\"\",T14,INDEX(Shift_Codes,IF(MATCH(U14,Shift_Codes,0)+1>COUNTA(Shift_Codes),1,MATCH(U14,Shift_Codes,0)+1))))","v":""},{"$f":"IF(OR($C14=\"\",W$7=\"\"),\"\",IF(V14=\"\",U14,INDEX(Shift_Codes,IF(MATCH(V14,Shift_Codes,0)+1>COUNTA(Shift_Codes),1,MATCH(V14,Shift_Codes,0)+1))))","v":""},{"$f":"IF(OR($C14=\"\",X$7=\"\"),\"\",IF(W14=\"\",V14,INDEX(Shift_Codes,IF(MATCH(W14,Shift_Codes,0)+1>COUNTA(Shift_Codes),1,MATCH(W14,Shift_Codes,0)+1))))","v":""},{"$f":"IF(OR($C14=\"\",Y$7=\"\"),\"\",IF(X14=\"\",W14,INDEX(Shift_Codes,IF(MATCH(X14,Shift_Codes,0)+1>COUNTA(Shift_Codes),1,MATCH(X14,Shift_Codes,0)+1))))","v":""},{"$f":"IF(OR($C14=\"\",Z$7=\"\"),\"\",IF(Y14=\"\",X14,INDEX(Shift_Codes,IF(MATCH(Y14,Shift_Codes,0)+1>COUNTA(Shift_Codes),1,MATCH(Y14,Shift_Codes,0)+1))))","v":""},{"$f":"IF(OR($C14=\"\",AA$7=\"\"),\"\",IF(Z14=\"\",Y14,INDEX(Shift_Codes,IF(MATCH(Z14,Shift_Codes,0)+1>COUNTA(Shift_Codes),1,MATCH(Z14,Shift_Codes,0)+1))))","v":""},{"$f":"IF(OR($C14=\"\",AB$7=\"\"),\"\",IF(AA14=\"\",Z14,INDEX(Shift_Codes,IF(MATCH(AA14,Shift_Codes,0)+1>COUNTA(Shift_Codes),1,MATCH(AA14,Shift_Codes,0)+1))))","v":""},{"$f":"IF(OR($C14=\"\",AC$7=\"\"),\"\",IF(AB14=\"\",AA14,INDEX(Shift_Codes,IF(MATCH(AB14,Shift_Codes,0)+1>COUNTA(Shift_Codes),1,MATCH(AB14,Shift_Codes,0)+1))))","v":""},{"$f":"IF(OR($C14=\"\",AD$7=\"\"),\"\",IF(AC14=\"\",AB14,INDEX(Shift_Codes,IF(MATCH(AC14,Shift_Codes,0)+1>COUNTA(Shift_Codes),1,MATCH(AC14,Shift_Codes,0)+1))))","v":""},{"$f":"IF(OR($C14=\"\",AE$7=\"\"),\"\",IF(AD14=\"\",AC14,INDEX(Shift_Codes,IF(MATCH(AD14,Shift_Codes,0)+1>COUNTA(Shift_Codes),1,MATCH(AD14,Shift_Codes,0)+1))))","v":""},{"$f":"IF(OR($C14=\"\",AF$7=\"\"),\"\",IF(AE14=\"\",AD14,INDEX(Shift_Codes,IF(MATCH(AE14,Shift_Codes,0)+1>COUNTA(Shift_Codes),1,MATCH(AE14,Shift_Codes,0)+1))))","v":""},{"$f":"IF(OR($C14=\"\",AG$7=\"\"),\"\",IF(AF14=\"\",AE14,INDEX(Shift_Codes,IF(MATCH(AF14,Shift_Codes,0)+1>COUNTA(Shift_Codes),1,MATCH(AF14,Shift_Codes,0)+1))))","v":""},{"$f":"IF(OR($C14=\"\",AH$7=\"\"),\"\",IF(AG14=\"\",AF14,INDEX(Shift_Codes,IF(MATCH(AG14,Shift_Codes,0)+1>COUNTA(Shift_Codes),1,MATCH(AG14,Shift_Codes,0)+1))))","v":""},{"$f":"IF(OR($C14=\"\",AI$7=\"\"),\"\",IF(AH14=\"\",AG14,INDEX(Shift_Codes,IF(MATCH(AH14,Shift_Codes,0)+1>COUNTA(Shift_Codes),1,MATCH(AH14,Shift_Codes,0)+1))))","v":""},null,0,0]
[null,null,null,null,{"$f":"IF(OR($C15=\"\",E$7=\"\"),\"\",IF(D15=\"\",C15,INDEX(Shift_Codes,IF(MATCH(D15,Shift_Codes,0)+1>COUNTA(Shift_Codes),1,MATCH(D15,Shift_Codes,0)+1))))","v":""},{"$f":"IF(OR($C15=\"\",F$7=\"\"),\"\",IF(E15=\"\",D15,INDEX(Shift_Codes,IF(MATCH(E15,Shift_Codes,0)+1>COUNTA(Shift_Codes),1,MATCH(E15,Shift_Codes,0)+1))))","v":""},{"$f":"IF(OR($C15=\"\",G$7=\"\"),\"\",IF(F15=\"\",E15,INDEX(Shift_Codes,IF(MATCH(F15,Shift_Codes,0)+1>COUNTA(Shift_Codes),1,MATCH(F15,Shift_Codes,0)+1))))","v":""},{"$f":"IF(OR($C15=\"\",H$7=\"\"),\"\",IF(G15=\"\",F15,INDEX(Shift_Codes,IF(MATCH(G15,Shift_Codes,0)+1>COUNTA(Shift_Codes),1,MATCH(G15,Shift_Codes,0)+1))))","v":""},{"$f":"IF(OR($C15=\"\",I$7=\"\"),\"\",IF(H15=\"\",G15,INDEX(Shift_Codes,IF(MATCH(H15,Shift_Codes,0)+1>COUNTA(Shift_Codes),1,MATCH(H15,Shift_Codes,0)+1))))","v":""},{"$f":"IF(OR($C15=\"\",J$7=\"\"),\"\",IF(I15=\"\",H15,INDEX(Shift_Codes,IF(MATCH(I15,Shift_Codes,0)+1>COUNTA(Shift_Codes),1,MATCH(I15,Shift_Codes,0)+1))))","v":""},{"$f":"IF(OR($C15=\"\",K$7=\"\"),\"\",IF(J15=\"\",I15,INDEX(Shift_Codes,IF(MATCH(J15,Shift_Codes,0)+1>COUNTA(Shift_Codes),1,MATCH(J15,Shift_Codes,0)+1))))","v":""},{"$f":"IF(OR($C15=\"\",L$7=\"\"),\"\",IF(K15=\"\",J15,INDEX(Shift_Codes,IF(MATCH(K15,Shift_Codes,0)+1>COUNTA(Shift_Codes),1,MATCH(K15,Shift_Codes,0)+1))))","v":""},{"$f":"IF(OR($C15=\"\",M$7=\"\"),\"\",IF(L15=\"\",K15,INDEX(Shift_Codes,IF(MATCH(L15,Shift_Codes,0)+1>COUNTA(Shift_Codes),1,MATCH(L15,Shift_Codes,0)+1))))","v":""},{"$f":"IF(OR($C15=\"\",N$7=\"\"),\"\",IF(M15=\"\",L15,INDEX(Shift_Codes,IF(MATCH(M15,Shift_Codes,0)+1>COUNTA(Shift_Codes),1,MATCH(M15,Shift_Codes,0)+1))))","v":""},{"$f":"IF(OR($C15=\"\",O$7=\"\"),\"\",IF(N15=\"\",M15,INDEX(Shift_Codes,IF(MATCH(N15,Shift_Codes,0)+1>COUNTA(Shift_Codes),1,MATCH(N15,Shift_Codes,0)+1))))","v":""},{"$f":"IF(OR($C15=\"\",P$7=\"\"),\"\",IF(O15=\"\",N15,INDEX(Shift_Codes,IF(MATCH(O15,Shift_Codes,0)+1>COUNTA(Shift_Codes),1,MATCH(O15,Shift_Codes,0)+1))))","v":""},{"$f":"IF(OR($C15=\"\",Q$7=\"\"),\"\",IF(P15=\"\",O15,INDEX(Shift_Codes,IF(MATCH(P15,Shift_Codes,0)+1>COUNTA(Shift_Codes),1,MATCH(P15,Shift_Codes,0)+1))))","v":""},{"$f":"IF(OR($C15=\"\",R$7=\"\"),\"\",IF(Q15=\"\",P15,INDEX(Shift_Codes,IF(MATCH(Q15,Shift_Codes,0)+1>COUNTA(Shift_Codes),1,MATCH(Q15,Shift_Codes,0)+1))))","v":""},{"$f":"IF(OR($C15=\"\",S$7=\"\"),\"\",IF(R15=\"\",Q15,INDEX(Shift_Codes,IF(MATCH(R15,Shift_Codes,0)+1>COUNTA(Shift_Codes),1,MATCH(R15,Shift_Codes,0)+1))))","v":""},{"$f":"IF(OR($C15=\"\",T$7=\"\"),\"\",IF(S15=\"\",R15,INDEX(Shift_Codes,IF(MATCH(S15,Shift_Codes,0)+1>COUNTA(Shift_Codes),1,MATCH(S15,Shift_Codes,0)+1))))","v":""},{"$f":"IF(OR($C15=\"\",U$7=\"\"),\"\",IF(T15=\"\",S15,INDEX(Shift_Codes,IF(MATCH(T15,Shift_Codes,0)+1>COUNTA(Shift_Codes),1,MATCH(T15,Shift_Codes,0)+1))))","v":""},{"$f":"IF(OR($C15=\"\",V$7=\"\"),\"\",IF(U15=\"\",T15,INDEX(Shift_Codes,IF(MATCH(U15,Shift_Codes,0)+1>COUNTA(Shift_Codes),1,MATCH(U15,Shift_Codes,0)+1))))","v":""},{"$f":"IF(OR($C15=\"\",W$7=\"\"),\"\",IF(V15=\"\",U15,INDEX(Shift_Codes,IF(MATCH(V15,Shift_Codes,0)+1>COUNTA(Shift_Codes),1,MATCH(V15,Shift_Codes,0)+1))))","v":""},{"$f":"IF(OR($C15=\"\",X$7=\"\"),\"\",IF(W15=\"\",V15,INDEX(Shift_Codes,IF(MATCH(W15,Shift_Codes,0)+1>COUNTA(Shift_Codes),1,MATCH(W15,Shift_Codes,0)+1))))","v":""},{"$f":"IF(OR($C15=\"\",Y$7=\"\"),\"\",IF(X15=\"\",W15,INDEX(Shift_Codes,IF(MATCH(X15,Shift_Codes,0)+1>COUNTA(Shift_Codes),1,MATCH(X15,Shift_Codes,0)+1))))","v":""},{"$f":"IF(OR($C15=\"\",Z$7=\"\"),\"\",IF(Y15=\"\",X15,INDEX(Shift_Codes,IF(MATCH(Y15,Shift_Codes,0)+1>COUNTA(Shift_Codes),1,MATCH(Y15,Shift_Codes,0)+1))))","v":""},{"$f":"IF(OR($C15=\"\",AA$7=\"\"),\"\",IF(Z15=\"\",Y15,INDEX(Shift_Codes,IF(MATCH(Z15,Shift_Codes,0)+1>COUNTA(Shift_Codes),1,MATCH(Z15,Shift_Codes,0)+1))))","v":""},{"$f":"IF(OR($C15=\"\",AB$7=\"\"),\"\",IF(AA15=\"\",Z15,INDEX(Shift_Codes,IF(MATCH(AA15,Shift_Codes,0)+1>COUNTA(Shift_Codes),1,MATCH(AA15,Shift_Codes,0)+1))))","v":""},{"$f":"IF(OR($C15=\"\",AC$7=\"\"),\"\",IF(AB15=\"\",AA15,INDEX(Shift_Codes,IF(MATCH(AB15,Shift_Codes,0)+1>COUNTA(Shift_Codes),1,MATCH(AB15,Shift_Codes,0)+1))))","v":""},{"$f":"IF(OR($C15=\"\",AD$7=\"\"),\"\",IF(AC15=\"\",AB15,INDEX(Shift_Codes,IF(MATCH(AC15,Shift_Codes,0)+1>COUNTA(Shift_Codes),1,MATCH(AC15,Shift_Codes,0)+1))))","v":""},{"$f":"IF(OR($C15=\"\",AE$7=\"\"),\"\",IF(AD15=\"\",AC15,INDEX(Shift_Codes,IF(MATCH(AD15,Shift_Codes,0)+1>COUNTA(Shift_Codes),1,MATCH(AD15,Shift_Codes,0)+1))))","v":""},{"$f":"IF(OR($C15=\"\",AF$7=\"\"),\"\",IF(AE15=\"\",AD15,INDEX(Shift_Codes,IF(MATCH(AE15,Shift_Codes,0)+1>COUNTA(Shift_Codes),1,MATCH(AE15,Shift_Codes,0)+1))))","v":""},{"$f":"IF(OR($C15=\"\",AG$7=\"\"),\"\",IF(AF15=\"\",AE15,INDEX(Shift_Codes,IF(MATCH(AF15,Shift_Codes,0)+1>COUNTA(Shift_Codes),1,MATCH(AF15,Shift_Codes,0)+1))))","v":""},{"$f":"IF(OR($C15=\"\",AH$7=\"\"),\"\",IF(AG15=\"\",AF15,INDEX(Shift_Codes,IF(MATCH(AG15,Shift_Codes,0)+1>COUNTA(Shift_Codes),1,MATCH(AG15,Shift_Codes,0)+1))))","v":""},{"$f":"IF(OR($C15=\"\",AI$7=\"\"),\"\",IF(AH15=\"\",AG15,INDEX(Shift_Codes,IF(MATCH(AH15,Shift_Codes,0)+1>COUNTA(Shift_Codes),1,MATCH(AH15,Shift_Codes,0)+1))))","v":""},null,0,0]
[null,null,null,null,{"$f":"IF(OR($C16=\"\",E$7=\"\"),\"\",IF(D16=\"\",C16,INDEX(Shift_Codes,IF(MATCH(D16,Shift_Codes,0)+1>COUNTA(Shift_Codes),1,MATCH(D16,Shift_Codes,0)+1))))","v":""},{"$f":"IF(OR($C16=\"\",F$7=\"\"),\"\",IF(E16=\"\",D16,INDEX(Shift_Codes,IF(MATCH(E16,Shift_Codes,0)+1>COUNTA(Shift_Codes),1,MATCH(E16,Shift_Codes,0)+1))))","v":""},{"$f":"IF(OR($C16=\"\",G$7=\"\"),\"\",IF(F16=\"\",E16,INDEX(Shift_Codes,IF(MATCH(F16,Shift_Codes,0)+1>COUNTA(Shift_Codes),1,MATCH(F16,Shift_Codes,0)+1))))","v":""},{"$f":"IF(OR($C16=\"\",H$7=\"\"),\"\",IF(G16=\"\",F16,INDEX(Shift_Codes,IF(MATCH(G16,Shift_Codes,0)+1>COUNTA(Shift_Codes),1,MATCH(G16,Shift_Codes,0)+1))))","v":""},{"$f":"IF(OR($C16=\"\",I$7=\"\"),\"\",IF(H16=\"\",G16,INDEX(Shift_Codes,IF(MATCH(H16,Shift_Codes,0)+1>COUNTA(Shift_Codes),1,MATCH(H16,Shift_Codes,0)+1))))","v":""},{"$f":"IF(OR($C16=\"\",J$7=\"\"),\"\",IF(I16=\"\",H16,INDEX(Shift_Codes,IF(MATCH(I16,Shift_Codes,0)+1>COUNTA(Shift_Codes),1,MATCH(I16,Shift_Codes,0)+1))))","v":""},{"$f":"IF(OR($C16=\"\",K$7=\"\"),\"\",IF(J16=\"\",I16,INDEX(Shift_Codes,IF(MATCH(J16,Shift_Codes,0)+1>COUNTA(Shift_Codes),1,MATCH(J16,Shift_Codes,0)+1))))","v":""},{"$f":"IF(OR($C16=\"\",L$7=\"\"),\"\",IF(K16=\"\",J16,INDEX(Shift_Codes,IF(MATCH(K16,Shift_Codes,0)+1>COUNTA(Shift_Codes),1,MATCH(K16,Shift_Codes,0)+1))))","v":""},{"$f":"IF(OR($C16=\"\",M$7=\"\"),\"\",IF(L16=\"\",K16,INDEX(Shift_Codes,IF(MATCH(L16,Shift_Codes,0)+1>COUNTA(Shift_Codes),1,MATCH(L16,Shift_Codes,0)+1))))","v":""},{"$f":"IF(OR($C16=\"\",N$7=\"\"),\"\",IF(M16=\"\",L16,INDEX(Shift_Codes,IF(MATCH(M16,Shift_Codes,0)+1>COUNTA(Shift_Codes),1,MATCH(M16,Shift_Codes,0)+1))))","v":""},{"$f":"IF(OR($C16=\"\",O$7=\"\"),\"\",IF(N16=\"\",M16,INDEX(Shift_Codes,IF(MATCH(N16,Shift_Codes,0)+1>COUNTA(Shift_Codes),1,MATCH(N16,Shift_Codes,0)+1))))","v":""},{"$f":"IF(OR($C16=\"\",P$7=\"\"),\"\",IF(O16=\"\",N16,INDEX(Shift_Codes,IF(MATCH(O16,Shift_Codes,0)+1>COUNTA(Shift_Codes),1,MATCH(O16,Shift_Codes,0)+1))))","v":""},{"$f":"IF(OR($C16=\"\",Q$7=\"\"),\"\",IF(P16=\"\",O16,INDEX(Shift_Codes,IF(MATCH(P16,Shift_Codes,0)+1>COUNTA(Shift_Codes),1,MATCH(P16,Shift_Codes,0)+1))))","v":""},{"$f":"IF(OR($C16=\"\",R$7=\"\"),\"\",IF(Q16=\"\",P16,INDEX(Shift_Codes,IF(MATCH(Q16,Shift_Codes,0)+1>COUNTA(Shift_Codes),1,MATCH(Q16,Shift_Codes,0)+1))))","v":""},{"$f":"IF(OR($C16=\"\",S$7=\"\"),\"\",IF(R16=\"\",Q16,INDEX(Shift_Codes,IF(MATCH(R16,Shift_Codes,0)+1>COUNTA(Shift_Codes),1,MATCH(R16,Shift_Codes,0)+1))))","v":""},{"$f":"IF(OR($C16=\"\",T$7=\"\"),\"\",IF(S16=\"\",R16,INDEX(Shift_Codes,IF(MATCH(S16,Shift_Codes,0)+1>COUNTA(Shift_Codes),1,MATCH(S16,Shift_Codes,0)+1))))","v":""},{"$f":"IF(OR($C16=\"\",U$7=\"\"),\"\",IF(T16=\"\",S16,INDEX(Shift_Codes,IF(MATCH(T16,Shift_Codes,0)+1>COUNTA(Shift_Codes),1,MATCH(T16,Shift_Codes,0)+1))))","v":""},{"$f":"IF(OR($C16=\"\",V$7=\"\"),\"\",IF(U16=\"\",T16,INDEX(Shift_Codes,IF(MATCH(U16,Shift_Codes,0)+1>COUNTA(Shift_Codes),1,MATCH(U16,Shift_Codes,0)+1))))","v":""},{"$f":"IF(OR($C16=\"\",W$7=\"\"),\"\",IF(V16=\"\",U16,INDEX(Shift_Codes,IF(MATCH(V16,Shift_Codes,0)+1>COUNTA(Shift_Codes),1,MATCH(V16,Shift_Codes,0)+1))))","v":""},{"$f":"IF(OR($C16=\"\",X$7=\"\"),\"\",IF(W16=\"\",V16,INDEX(Shift_Codes,IF(MATCH(W16,Shift_Codes,0)+1>COUNTA(Shift_Codes),1,MATCH(W16,Shift_Codes,0)+1))))","v":""},{"$f":"IF(OR($C16=\"\",Y$7=\"\"),\"\",IF(X16=\"\",W16,INDEX(Shift_Codes,IF(MATCH(X16,Shift_Codes,0)+1>COUNTA(Shift_Codes),1,MATCH(X16,Shift_Codes,0)+1))))","v":""},{"$f":"IF(OR($C16=\"\",Z$7=\"\"),\"\",IF(Y16=\"\",X16,INDEX(Shift_Codes,IF(MATCH(Y16,Shift_Codes,0)+1>COUNTA(Shift_Codes),1,MATCH(Y16,Shift_Codes,0)+1))))","v":""},{"$f":"IF(OR($C16=\"\",AA$7=\"\"),\"\",IF(Z16=\"\",Y16,INDEX(Shift_Codes,IF(MATCH(Z16,Shift_Codes,0)+1>COUNTA(Shift_Codes),1,MATCH(Z16,Shift_Codes,0)+1))))","v":""},{"$f":"IF(OR($C16=\"\",AB$7=\"\"),\"\",IF(AA16=\"\",Z16,INDEX(Shift_Codes,IF(MATCH(AA16,Shift_Codes,0)+1>COUNTA(Shift_Codes),1,MATCH(AA16,Shift_Codes,0)+1))))","v":""},{"$f":"IF(OR($C16=\"\",AC$7=\"\"),\"\",IF(AB16=\"\",AA16,INDEX(Shift_Codes,IF(MATCH(AB16,Shift_Codes,0)+1>COUNTA(Shift_Codes),1,MATCH(AB16,Shift_Codes,0)+1))))","v":""},{"$f":"IF(OR($C16=\"\",AD$7=\"\"),\"\",IF(AC16=\"\",AB16,INDEX(Shift_Codes,IF(MATCH(AC16,Shift_Codes,0)+1>COUNTA(Shift_Codes),1,MATCH(AC16,Shift_Codes,0)+1))))","v":""},{"$f":"IF(OR($C16=\"\",AE$7=\"\"),\"\",IF(AD16=\"\",AC16,INDEX(Shift_Codes,IF(MATCH(AD16,Shift_Codes,0)+1>COUNTA(Shift_Codes),1,MATCH(AD16,Shift_Codes,0)+1))))","v":""},{"$f":"IF(OR($C16=\"\",AF$7=\"\"),\"\",IF(AE16=\"\",AD16,INDEX(Shift_Codes,IF(MATCH(AE16,Shift_Codes,0)+1>COUNTA(Shift_Codes),1,MATCH(AE16,Shift_Codes,0)+1))))","v":""},{"$f":"IF(OR($C16=\"\",AG$7=\"\"),\"\",IF(AF16=\"\",AE16,INDEX(Shift_Codes,IF(MATCH(AF16,Shift_Codes,0)+1>COUNTA(Shift_Codes),1,MATCH(AF16,Shift_Codes,0)+1))))","v":""},{"$f":"IF(OR($C16=\"\",AH$7=\"\"),\"\",IF(AG16=\"\",AF16,INDEX(Shift_Codes,IF(MATCH(AG16,Shift_Codes,0)+1>COUNTA(Shift_Codes),1,MATCH(AG16,Shift_Codes,0)+1))))","v":""},{"$f":"IF(OR($C16=\"\",AI$7=\"\"),\"\",IF(AH16=\"\",AG16,INDEX(Shift_Codes,IF(MATCH(AH16,Shift_Codes,0)+1>COUNTA(Shift_Codes),1,MATCH(AH16,Shift_Codes,0)+1))))","v":""},null,0,0]
[null,null,null,null,{"$f":"IF(OR($C17=\"\",E$7=\"\"),\"\",IF(D17=\"\",C17,INDEX(Shift_Codes,IF(MATCH(D17,Shift_Codes,0)+1>COUNTA(Shift_Codes),1,MATCH(D17,Shift_Codes,0)+1))))","v":""},{"$f":"IF(OR($C17=\"\",F$7=\"\"),\"\",IF(E17=\"\",D17,INDEX(Shift_Codes,IF(MATCH(E17,Shift_Codes,0)+1>COUNTA(Shift_Codes),1,MATCH(E17,Shift_Codes,0)+1))))","v":""},{"$f":"IF(OR($C17=\"\",G$7=\"\"),\"\",IF(F17=\"\",E17,INDEX(Shift_Codes,IF(MATCH(F17,Shift_Codes,0)+1>COUNTA(Shift_Codes),1,MATCH(F17,Shift_Codes,0)+1))))","v":""},{"$f":"IF(OR($C17=\"\",H$7=\"\"),\"\",IF(G17=\"\",F17,INDEX(Shift_Codes,IF(MATCH(G17,Shift_Codes,0)+1>COUNTA(Shift_Codes),1,MATCH(G17,Shift_Codes,0)+1))))","v":""},{"$f":"IF(OR($C17=\"\",I$7=\"\"),\"\",IF(H17=\"\",G17,INDEX(Shift_Codes,IF(MATCH(H17,Shift_Codes,0)+1>COUNTA(Shift_Codes),1,MATCH(H17,Shift_Codes,0)+1))))","v":""},{"$f":"IF(OR($C17=\"\",J$7=\"\"),\"\",IF(I17=\"\",H17,INDEX(Shift_Codes,IF(MATCH(I17,Shift_Codes,0)+1>COUNTA(Shift_Codes),1,MATCH(I17,Shift_Codes,0)+1))))","v":""},{"$f":"IF(OR($C17=\"\",K$7=\"\"),\"\",IF(J17=\"\",I17,INDEX(Shift_Codes,IF(MATCH(J17,Shift_Codes,0)+1>COUNTA(Shift_Codes),1,MATCH(J17,Shift_Codes,0)+1))))","v":""},{"$f":"IF(OR($C17=\"\",L$7=\"\"),\"\",IF(K17=\"\",J17,INDEX(Shift_Codes,IF(MATCH(K17,Shift_Codes,0)+1>COUNTA(Shift_Codes),1,MATCH(K17,Shift_Codes,0)+1))))","v":""},{"$f":"IF(OR($C17=\"\",M$7=\"\"),\"\",IF(L17=\"\",K17,INDEX(Shift_Codes,IF(MATCH(L17,Shift_Codes,0)+1>COUNTA(Shift_Codes),1,MATCH(L17,Shift_Codes,0)+1))))","v":""},{"$f":"IF(OR($C17=\"\",N$7=\"\"),\"\",IF(M17=\"\",L17,INDEX(Shift_Codes,IF(MATCH(M17,Shift_Codes,0)+1>COUNTA(Shift_Codes),1,MATCH(M17,Shift_Codes,0)+1))))","v":""},{"$f":"IF(OR($C17=\"\",O$7=\"\"),\"\",IF(N17=\"\",M17,INDEX(Shift_Codes,IF(MATCH(N17,Shift_Codes,0)+1>COUNTA(Shift_Codes),1,MATCH(N17,Shift_Codes,0)+1))))","v":""},{"$f":"IF(OR($C17=\"\",P$7=\"\"),\"\",IF(O17=\"\",N17,INDEX(Shift_Codes,IF(MATCH(O17,Shift_Codes,0)+1>COUNTA(Shift_Codes),1,MATCH(O17,Shift_Codes,0)+1))))","v":""},{"$f":"IF(OR($C17=\"\",Q$7=\"\"),\"\",IF(P17=\"\",O17,INDEX(Shift_Codes,IF(MATCH(P17,Shift_Codes,0)+1>COUNTA(Shift_Codes),1,MATCH(P17,Shift_Codes,0)+1))))","v":""},{"$f":"IF(OR($C17=\"\",R$7=\"\"),\"\",IF(Q17=\"\",P17,INDEX(Shift_Codes,IF(MATCH(Q17,Shift_Codes,0)+1>COUNTA(Shift_Codes),1,MATCH(Q17,Shift_Codes,0)+1))))","v":""},{"$f":"IF(OR($C17=\"\",S$7=\"\"),\"\",IF(R17=\"\",Q17,INDEX(Shift_Codes,IF(MATCH(R17,Shift_Codes,0)+1>COUNTA(Shift_Codes),1,MATCH(R17,Shift_Codes,0)+1))))","v":""},{"$f":"IF(OR($C17=\"\",T$7=\"\"),\"\",IF(S17=\"\",R17,INDEX(Shift_Codes,IF(MATCH(S17,Shift_Codes,0)+1>COUNTA(Shift_Codes),1,MATCH(S17,Shift_Codes,0)+1))))","v":""},{"$f":"IF(OR($C17=\"\",U$7=\"\"),\"\",IF(T17=\"\",S17,INDEX(Shift_Codes,IF(MATCH(T17,Shift_Codes,0)+1>COUNTA(Shift_Codes),1,MATCH(T17,Shift_Codes,0)+1))))","v":""},{"$f":"IF(OR($C17=\"\",V$7=\"\"),\"\",IF(U17=\"\",T17,INDEX(Shift_Codes,IF(MATCH(U17,Shift_Codes,0)+1>COUNTA(Shift_Codes),1,MATCH(U17,Shift_Codes,0)+1))))","v":""},{"$f":"IF(OR($C17=\"\",W$7=\"\"),\"\",IF(V17=\"\",U17,INDEX(Shift_Codes,IF(MATCH(V17,Shift_Codes,0)+1>COUNTA(Shift_Codes),1,MATCH(V17,Shift_Codes,0)+1))))","v":""},{"$f":"IF(OR($C17=\"\",X$7=\"\"),\"\",IF(W17=\"\",V17,INDEX(Shift_Codes,IF(MATCH(W17,Shift_Codes,0)+1>COUNTA(Shift_Codes),1,MATCH(W17,Shift_Codes,0)+1))))","v":""},{"$f":"IF(OR($C17=\"\",Y$7=\"\"),\"\",IF(X17=\"\",W17,INDEX(Shift_Codes,IF(MATCH(X17,Shift_Codes,0)+1>COUNTA(Shift_Codes),1,MATCH(X17,Shift_Codes,0)+1))))","v":""},{"$f":"IF(OR($C17=\"\",Z$7=\"\"),\"\",IF(Y17=\"\",X17,INDEX(Shift_Codes,IF(MATCH(Y17,Shift_Codes,0)+1>COUNTA(Shift_Codes),1,MATCH(Y17,Shift_Codes,0)+1))))","v":""},{"$f":"IF(OR($C17=\"\",AA$7=\"\"),\"\",IF(Z17=\"\",Y17,INDEX(Shift_Codes,IF(MATCH(Z17,Shift_Codes,0)+1>COUNTA(Shift_Codes),1,MATCH(Z17,Shift_Codes,0)+1))))","v":""},{"$f":"IF(OR($C17=\"\",AB$7=\"\"),\"\",IF(AA17=\"\",Z17,INDEX(Shift_Codes,IF(MATCH(AA17,Shift_Codes,0)+1>COUNTA(Shift_Codes),1,MATCH(AA17,Shift_Codes,0)+1))))","v":""},{"$f":"IF(OR($C17=\"\",AC$7=\"\"),\"\",IF(AB17=\"\",AA17,INDEX(Shift_Codes,IF(MATCH(AB17,Shift_Codes,0)+1>COUNTA(Shift_Codes),1,MATCH(AB17,Shift_Codes,0)+1))))","v":""},{"$f":"IF(OR($C17=\"\",AD$7=\"\"),\"\",IF(AC17=\"\",AB17,INDEX(Shift_Codes,IF(MATCH(AC17,Shift_Codes,0)+1>COUNTA(Shift_Codes),1,MATCH(AC17,Shift_Codes,0)+1))))","v":""},{"$f":"IF(OR($C17=\"\",AE$7=\"\"),\"\",IF(AD17=\"\",AC17,INDEX(Shift_Codes,IF(MATCH(AD17,Shift_Codes,0)+1>COUNTA(Shift_Codes),1,MATCH(AD17,Shift_Codes,0)+1))))","v":""},{"$f":"IF(OR($C17=\"\",AF$7=\"\"),\"\",IF(AE17=\"\",AD17,INDEX(Shift_Codes,IF(MATCH(AE17,Shift_Codes,0)+1>COUNTA(Shift_Codes),1,MATCH(AE17,Shift_Codes,0)+1))))","v":""},{"$f":"IF(OR($C17=\"\",AG$7=\"\"),\"\",IF(AF17=\"\",AE17,INDEX(Shift_Codes,IF(MATCH(AF17,Shift_Codes,0)+1>COUNTA(Shift_Codes),1,MATCH(AF17,Shift_Codes,0)+1))))","v":""},{"$f":"IF(OR($C17=\"\",AH$7=\"\"),\"\",IF(AG17=\"\",AF17,INDEX(Shift_Codes,IF(MATCH(AG17,Shift_Codes,0)+1>COUNTA(Shift_Codes),1,MATCH(AG17,Shift_Codes,0)+1))))","v":""},{"$f":"IF(OR($C17=\"\",AI$7=\"\"),\"\",IF(AH17=\"\",AG17,INDEX(Shift_Codes,IF(MATCH(AH17,Shift_Codes,0)+1>COUNTA(Shift_Codes),1,MATCH(AH17,Shift_Codes,0)+1))))","v":""},null,0,0]
[]
[null,"Total Day Shift Employees",null,null,{"$f":"COUNTIF(E$8:E$17,\"D*\")","v":1},{"$f":"COUNTIF(F$8:F$17,\"D*\")","v":0},0,0,1,1,1,0,0,0,1,1,1,0,0,0,1,1,1,0,0,0,1,1,1,0,0,0,1,1,1]
[null,"Total Night Shift Employees",null,null,{"$f":"COUNTIF(E$8:E$17,\"N*\")","v":0},{"$f":"COUNTIF(F$8:F$17,\"N*\")","v":1},1,1,0,0,0,1,1,1,0,0,0,1,1,1,0,0,0,1,1,1,0,0,0,1,1,1,0,0,0]

{"sheet":"April 2021","index":2,"n_rows":20,"n_cols":38,"rows_kept":20,"cut":false,"hidden":false,"merged":[[19,1,19,2],[5,1,6,1],[5,2,6,2],[5,36,6,36],[5,37,6,37],[6,3,16,3],[18,1,18,2],[1,1,3,2],[1,4,2,21],[1,22,2,27],[1,28,2,31],[1,32,2,34],[3,18,3,19],[3,20,3,22],[3,23,3,25],[3,26,3,27],[3,28,3,30],[1,36,3,37],[3,4,3,8],[3,10,3,11],[3,12,3,14],[3,15,3,17],[3,32,3,34]]}
[]
[null,"Logo",null,null,"Roster of",null,null,null,null,null,null,null,null,null,null,null,null,null,null,null,null,null,"April",null,null,null,null,null,2021,null,null,null,null,null,null,null,"Final Report"]
[]
[null,null,null,null,"Month Starting Date:",null,null,null,null,1,null,null,"Start Date:",null,null,{"$f":"IFERROR(DATEVALUE(J4&W2&AC2),\"\")","v":"2021-04-01"},null,null,null,null,"End Date:",null,null,{"$f":"IFERROR(EOMONTH(P4,0)+J4-1,\"\")","v":"2021-04-30"},null,null,null,null,"Total Days:",null,null,{"$f":"X4-P4+1","v":30}]
[]
[null,"Employee","Starting Shift",null,{"$f":"TEXT(E7,\"ddd\")","v":"Thu"},{"$f":"TEXT(F7,\"ddd\")","v":"Fri"},"Sat","Sun","Mon","Tue","Wed","Thu","Fri","Sat","Sun","Mon","Tue","Wed","Thu","Fri","Sat","Sun","Mon","Tue","Wed","Thu","Fri","Sat","Sun","Mon","Tue","Wed","Thu","Fri","",null,"Total Day Shifts","Total Night Shifts"]
[null,null,null,null,{"$f":"P4","v":"2021-04-01"},{"$f":"IF(E7>=$X$4,\"\",E7+1)","v":"2021-04-02"},"2021-04-03","2021-04-04","2021-04-05","2021-04-06","2021-04-07","2021-04-08","2021-04-09","2021-04-10","2021-04-11","2021-04-12","2021-04-13","2021-04-14","2021-04-15","2021-04-16","2021-04-17","2021-04-18","2021-04-19","2021-04-20","2021-04-21","2021-04-22","2021-04-23","2021-04-24","2021-04-25","2021-04-26","2021-04-27","2021-04-28","2021-04-29","2021-04-30",""]
[null,"Jack","D3",null,{"$f":"IF(OR($C8=\"\",E$7=\"\"),\"\",IF(D8=\"\",C8,INDEX(Shift_Codes,IF(MATCH(D8,Shift_Codes,0)+1>COUNTA(Shift_Codes),1,MATCH(D8,Shift_Codes,0)+1))))","v":"D3"},{"$f":"IF(OR($C8=\"\",F$7=\"\"),\"\",IF(E8=\"\",D8,INDEX(Shift_Codes,IF(MATCH(E8,Shift_Codes,0)+1>COUNTA(Shift_Codes),1,MATCH(E8,Shift_Codes,0)+1))))","v":"N1"},{"$f":"IF(OR($C8=\"\",G$7=\"\"),\"\",IF(F8=\"\",E8,INDEX(Shift_Codes,IF(MATCH(F8,Shift_Codes,0)+1>COUNTA(Shift_Codes),1,MATCH(F8,Shift_Codes,0)+1))))","v":"N2"},{"$f":"IF(OR($C8=\"\",H$7=\"\"),\"\",IF(G8=\"\",F8,INDEX(Shift_Codes,IF(MATCH(G8,Shift_Codes,0)+1>COUNTA(Shift_Codes),1,MATCH(G8,Shift_Codes,0)+1))))","v":"N3"},{"$f":"IF(OR($C8=\"\",I$7=\"\"),\"\",IF(H8=\"\",G8,INDEX(Shift_Codes,IF(MATCH(H8,Shift_Codes,0)+1>COUNTA(Shift_Codes),1,MATCH(H8,Shift_Codes,0)+1))))","v":"D1"},{"$f":"IF(OR($C8=\"\",J$7=\"\"),\"\",IF(I8=\"\",H8,INDEX(Shift_Codes,IF(MATCH(I8,Shift_Codes,0)+1>COUNTA(Shift_Codes),1,MATCH(I8,Shift_Codes,0)+1))))","v":"D2"},{"$f":"IF(OR($C8=\"\",K$7=\"\"),\"\",IF(J8=\"\",I8,INDEX(Shift_Codes,IF(MATCH(J8,Shift_Codes,0)+1>COUNTA(Shift_Codes),1,MATCH(J8,Shift_Codes,0)+1))))","v":"D3"},{"$f":"IF(OR($C8=\"\",L$7=\"\"),\"\",IF(K8=\"\",J8,INDEX(Shift_Codes,IF(MATCH(K8,Shift_Codes,0)+1>COUNTA(Shift_Codes),1,MATCH(K8,Shift_Codes,0)+1))))","v":"N1"},{"$f":"IF(OR($C8=\"\",M$7=\"\"),\"\",IF(L8=\"\",K8,INDEX(Shift_Codes,IF(MATCH(L8,Shift_Codes,0)+1>COUNTA(Shift_Codes),1,MATCH(L8,Shift_Codes,0)+1))))","v":"N2"},{"$f":"IF(OR($C8=\"\",N$7=\"\"),\"\",IF(M8=\"\",L8,INDEX(Shift_Codes,IF(MATCH(M8,Shift_Codes,0)+1>COUNTA(Shift_Codes),1,MATCH(M8,Shift_Codes,0)+1))))","v":"N3"},{"$f":"IF(OR($C8=\"\",O$7=\"\"),\"\",IF(N8=\"\",M8,INDEX(Shift_Codes,IF(MATCH(N8,Shift_Codes,0)+1>COUNTA(Shift_Codes),1,MATCH(N8,Shift_Codes,0)+1))))","v":"D1"},{"$f":"IF(OR($C8=\"\",P$7=\"\"),\"\",IF(O8=\"\",N8,INDEX(Shift_Codes,IF(MATCH(O8,Shift_Codes,0)+1>COUNTA(Shift_Codes),1,MATCH(O8,Shift_Codes,0)+1))))","v":"D2"},{"$f":"IF(OR($C8=\"\",Q$7=\"\"),\"\",IF(P8=\"\",O8,INDEX(Shift_Codes,IF(MATCH(P8,Shift_Codes,0)+1>COUNTA(Shift_Codes),1,MATCH(P8,Shift_Codes,0)+1))))","v":"D3"},{"$f":"IF(OR($C8=\"\",R$7=\"\"),\"\",IF(Q8=\"\",P8,INDEX(Shift_Codes,IF(MATCH(Q8,Shift_Codes,0)+1>COUNTA(Shift_Codes),1,MATCH(Q8,Shift_Codes,0)+1))))","v":"N1"},{"$f":"IF(OR($C8=\"\",S$7=\"\"),\"\",IF(R8=\"\",Q8,INDEX(Shift_Codes,IF(MATCH(R8,Shift_Codes,0)+1>COUNTA(Shift_Codes),1,MATCH(R8,Shift_Codes,0)+1))))","v":"N2"},{"$f":"IF(OR($C8=\"\",T$7=\"\"),\"\",IF(S8=\"\",R8,INDEX(Shift_Codes,IF(MATCH(S8,Shift_Codes,0)+1>COUNTA(Shift_Codes),1,MATCH(S8,Shift_Codes,0)+1))))","v":"N3"},{"$f":"IF(OR($C8=\"\",U$7=\"\"),\"\",IF(T8=\"\",S8,INDEX(Shift_Codes,IF(MATCH(T8,Shift_Codes,0)+1>COUNTA(Shift_Codes),1,MATCH(T8,Shift_Codes,0)+1))))","v":"D1"},{"$f":"IF(OR($C8=\"\",V$7=\"\"),\"\",IF(U8=\"\",T8,INDEX(Shift_Codes,IF(MATCH(U8,Shift_Codes,0)+1>COUNTA(Shift_Codes),1,MATCH(U8,Shift_Codes,0)+1))))","v":"D2"},{"$f":"IF(OR($C8=\"\",W$7=\"\"),\"\",IF(V8=\"\",U8,INDEX(Shift_Codes,IF(MATCH(V8,Shift_Codes,0)+1>COUNTA(Shift_Codes),1,MATCH(V8,Shift_Codes,0)+1))))","v":"D3"},{"$f":"IF(OR($C8=\"\",X$7=\"\"),\"\",IF(W8=\"\",V8,INDEX(Shift_Codes,IF(MATCH(W8,Shift_Codes,0)+1>COUNTA(Shift_Codes),1,MATCH(W8,Shift_Codes,0)+1))))","v":"N1"},{"$f":"IF(OR($C8=\"\",Y$7=\"\"),\"\",IF(X8=\"\",W8,INDEX(Shift_Codes,IF(MATCH(X8,Shift_Codes,0)+1>COUNTA(Shift_Codes),1,MATCH(X8,Shift_Codes,0)+1))))","v":"N2"},{"$f":"IF(OR($C8=\"\",Z$7=\"\"),\"\",IF(Y8=\"\",X8,INDEX(Shift_Codes,IF(MATCH(Y8,Shift_Codes,0)+1>COUNTA(Shift_Codes),1,MATCH(Y8,Shift_Codes,0)+1))))","v":"N3"},{"$f":"IF(OR($C8=\"\",AA$7=\"\"),\"\",IF(Z8=\"\",Y8,INDEX(Shift_Codes,IF(MATCH(Z8,Shift_Codes,0)+1>COUNTA(Shift_Codes),1,MATCH(Z8,Shift_Codes,0)+1))))","v":"D1"},{"$f":"IF(OR($C8=\"\",AB$7=\"\"),\"\",IF(AA8=\"\",Z8,INDEX(Shift_Codes,IF(MATCH(AA8,Shift_Codes,0)+1>COUNTA(Shift_Codes),1,MATCH(AA8,Shift_Codes,0)+1))))","v":"D2"},{"$f":"IF(OR($C8=\"\",AC$7=\"\"),\"\",IF(AB8=\"\",AA8,INDEX(Shift_Codes,IF(MATCH(AB8,Shift_Codes,0)+1>COUNTA(Shift_Codes),1,MATCH(AB8,Shift_Codes,0)+1))))","v":"D3"},{"$f":"IF(OR($C8=\"\",AD$7=\"\"),\"\",IF(AC8=\"\",AB8,INDEX(Shift_Codes,IF(MATCH(AC8,Shift_Codes,0)+1>COUNTA(Shift_Codes),1,MATCH(AC8,Shift_Codes,0)+1))))","v":"N1"},{"$f":"IF(OR($C8=\"\",AE$7=\"\"),\"\",IF(AD8=\"\",AC8,INDEX(Shift_Codes,IF(MATCH(AD8,Shift_Codes,0)+1>COUNTA(Shift_Codes),1,MATCH(AD8,Shift_Codes,0)+1))))","v":"N2"},{"$f":"IF(OR($C8=\"\",AF$7=\"\"),\"\",IF(AE8=\"\",AD8,INDEX(Shift_Codes,IF(MATCH(AE8,Shift_Codes,0)+1>COUNTA(Shift_Codes),1,MATCH(AE8,Shift_Codes,0)+1))))","v":"N3"},{"$f":"IF(OR($C8=\"\",AG$7=\"\"),\"\",IF(AF8=\"\",AE8,INDEX(Shift_Codes,IF(MATCH(AF8,Shift_Codes,0)+1>COUNTA(Shift_Codes),1,MATCH(AF8,Shift_Codes,0)+1))))","v":"D1"},{"$f":"IF(OR($C8=\"\",AH$7=\"\"),\"\",IF(AG8=\"\",AF8,INDEX(Shift_Codes,IF(MATCH(AG8,Shift_Codes,0)+1>COUNTA(Shift_Codes),1,MATCH(AG8,Shift_Codes,0)+1))))","v":"D2"},{"$f":"IF(OR($C8=\"\",AI$7=\"\"),\"\",IF(AH8=\"\",AG8,INDEX(Shift_Codes,IF(MATCH(AH8,Shift_Codes,0)+1>COUNTA(Shift_Codes),1,MATCH(AH8,Shift_Codes,0)+1))))","v":""},null,{"$f":"COUNTIF($E8:$AI8,\"D*\")","v":15},{"$f":"COUNTIF($E8:$AI8,\"N*\")","v":15}]
[null,"Bill",null,null,{"$f":"IF(OR($C9=\"\",E$7=\"\"),\"\",IF(D9=\"\",C9,INDEX(Shift_Codes,IF(MATCH(D9,Shift_Codes,0)+1>COUNTA(Shift_Codes),1,MATCH(D9,Shift_Codes,0)+1))))","v":""},{"$f":"IF(OR($C9=\"\",F$7=\"\"),\"\",IF(E9=\"\",D9,INDEX(Shift_Codes,IF(MATCH(E9,Shift_Codes,0)+1>COUNTA(Shift_Codes),1,MATCH(E9,Shift_Codes,0)+1))))","v":""},{"$f":"IF(OR($C9=\"\",G$7=\"\"),\"\",IF(F9=\"\",E9,INDEX(Shift_Codes,IF(MATCH(F9,Shift_Codes,0)+1>COUNTA(Shift_Codes),1,MATCH(F9,Shift_Codes,0)+1))))","v":""},{"$f":"IF(OR($C9=\"\",H$7=\"\"),\"\",IF(G9=\"\",F9,INDEX(Shift_Codes,IF(MATCH(G9,Shift_Codes,0)+1>COUNTA(Shift_Codes),1,MATCH(G9,Shift_Codes,0)+1))))","v":""},{"$f":"IF(OR($C9=\"\",I$7=\"\"),\"\",IF(H9=\"\",G9,INDEX(Shift_Codes,IF(MATCH(H9,Shift_Codes,0)+1>COUNTA(Shift_Codes),1,MATCH(H9,Shift_Codes,0)+1))))","v":""},{"$f":"IF(OR($C9=\"\",J$7=\"\"),\"\",IF(I9=\"\",H9,INDEX(Shift_Codes,IF(MATCH(I9,Shift_Codes,0)+1>COUNTA(Shift_Codes),1,MATCH(I9,Shift_Codes,0)+1))))","v":""},{"$f":"IF(OR($C9=\"\",K$7=\"\"),\"\",IF(J9=\"\",I9,INDEX(Shift_Codes,IF(MATCH(J9,Shift_Codes,0)+1>COUNTA(Shift_Codes),1,MATCH(J9,Shift_Codes,0)+1))))","v":""},{"$f":"IF(OR($C9=\"\",L$7=\"\"),\"\",IF(K9=\"\",J9,INDEX(Shift_Codes,IF(MATCH(K9,Shift_Codes,0)+1>COUNTA(Shift_Codes),1,MATCH(K9,Shift_Codes,0)+1))))","v":""},{"$f":"IF(OR($C9=\"\",M$7=\"\"),\"\",IF(L9=\"\",K9,INDEX(Shift_Codes,IF(MATCH(L9,Shift_Codes,0)+1>COUNTA(Shift_Codes),1,MATCH(L9,Shift_Codes,0)+1))))","v":""},{"$f":"IF(OR($C9=\"\",N$7=\"\"),\"\",IF(M9=\"\",L9,INDEX(Shift_Codes,IF(MATCH(M9,Shift_Codes,0)+1>COUNTA(Shift_Codes),1,MATCH(M9,Shift_Codes,0)+1))))","v":""},{"$f":"IF(OR($C9=\"\",O$7=\"\"),\"\",IF(N9=\"\",M9,INDEX(Shift_Codes,IF(MATCH(N9,Shift_Codes,0)+1>COUNTA(Shift_Codes),1,MATCH(N9,Shift_Codes,0)+1))))","v":""},{"$f":"IF(OR($C9=\"\",P$7=\"\"),\"\",IF(O9=\"\",N9,INDEX(Shift_Codes,IF(MATCH(O9,Shift_Codes,0)+1>COUNTA(Shift_Codes),1,MATCH(O9,Shift_Codes,0)+1))))","v":""},{"$f":"IF(OR($C9=\"\",Q$7=\"\"),\"\",IF(P9=\"\",O9,INDEX(Shift_Codes,IF(MATCH(P9,Shift_Codes,0)+1>COUNTA(Shift_Codes),1,MATCH(P9,Shift_Codes,0)+1))))","v":""},{"$f":"IF(OR($C9=\"\",R$7=\"\"),\"\",IF(Q9=\"\",P9,INDEX(Shift_Codes,IF(MATCH(Q9,Shift_Codes,0)+1>COUNTA(Shift_Codes),1,MATCH(Q9,Shift_Codes,0)+1))))","v":""},{"$f":"IF(OR($C9=\"\",S$7=\"\"),\"\",IF(R9=\"\",Q9,INDEX(Shift_Codes,IF(MATCH(R9,Shift_Codes,0)+1>COUNTA(Shift_Codes),1,MATCH(R9,Shift_Codes,0)+1))))","v":""},{"$f":"IF(OR($C9=\"\",T$7=\"\"),\"\",IF(S9=\"\",R9,INDEX(Shift_Codes,IF(MATCH(S9,Shift_Codes,0)+1>COUNTA(Shift_Codes),1,MATCH(S9,Shift_Codes,0)+1))))","v":""},{"$f":"IF(OR($C9=\"\",U$7=\"\"),\"\",IF(T9=\"\",S9,INDEX(Shift_Codes,IF(MATCH(T9,Shift_Codes,0)+1>COUNTA(Shift_Codes),1,MATCH(T9,Shift_Codes,0)+1))))","v":""},{"$f":"IF(OR($C9=\"\",V$7=\"\"),\"\",IF(U9=\"\",T9,INDEX(Shift_Codes,IF(MATCH(U9,Shift_Codes,0)+1>COUNTA(Shift_Codes),1,MATCH(U9,Shift_Codes,0)+1))))","v":""},{"$f":"IF(OR($C9=\"\",W$7=\"\"),\"\",IF(V9=\"\",U9,INDEX(Shift_Codes,IF(MATCH(V9,Shift_Codes,0)+1>COUNTA(Shift_Codes),1,MATCH(V9,Shift_Codes,0)+1))))","v":""},{"$f":"IF(OR($C9=\"\",X$7=\"\"),\"\",IF(W9=\"\",V9,INDEX(Shift_Codes,IF(MATCH(W9,Shift_Codes,0)+1>COUNTA(Shift_Codes),1,MATCH(W9,Shift_Codes,0)+1))))","v":""},{"$f":"IF(OR($C9=\"\",Y$7=\"\"),\"\",IF(X9=\"\",W9,INDEX(Shift_Codes,IF(MATCH(X9,Shift_Codes,0)+1>COUNTA(Shift_Codes),1,MATCH(X9,Shift_Codes,0)+1))))","v":""},{"$f":"IF(OR($C9=\"\",Z$7=\"\"),\"\",IF(Y9=\"\",X9,INDEX(Shift_Codes,IF(MATCH(Y9,Shift_Codes,0)+1>COUNTA(Shift_Codes),1,MATCH(Y9,Shift_Codes,0)+1))))","v":""},{"$f":"IF(OR($C9=\"\",AA$7=\"\"),\"\",IF(Z9=\"\",Y9,INDEX(Shift_Codes,IF(MATCH(Z9,Shift_Codes,0)+1>COUNTA(Shift_Codes),1,MATCH(Z9,Shift_Codes,0)+1))))","v":""},{"$f":"IF(OR($C9=\"\",AB$7=\"\"),\"\",IF(AA9=\"\",Z9,INDEX(Shift_Codes,IF(MATCH(AA9,Shift_Codes,0)+1>COUNTA(Shift_Codes),1,MATCH(AA9,Shift_Codes,0)+1))))","v":""},{"$f":"IF(OR($C9=\"\",AC$7=\"\"),\"\",IF(AB9=\"\",AA9,INDEX(Shift_Codes,IF(MATCH(AB9,Shift_Codes,0)+1>COUNTA(Shift_Codes),1,MATCH(AB9,Shift_Codes,0)+1))))","v":""},{"$f":"IF(OR($C9=\"\",AD$7=\"\"),\"\",IF(AC9=\"\",AB9,INDEX(Shift_Codes,IF(MATCH(AC9,Shift_Codes,0)+1>COUNTA(Shift_Codes),1,MATCH(AC9,Shift_Codes,0)+1))))","v":""},{"$f":"IF(OR($C9=\"\",AE$7=\"\"),\"\",IF(AD9=\"\",AC9,INDEX(Shift_Codes,IF(MATCH(AD9,Shift_Codes,0)+1>COUNTA(Shift_Codes),1,MATCH(AD9,Shift_Codes,0)+1))))","v":""},{"$f":"IF(OR($C9=\"\",AF$7=\"\"),\"\",IF(AE9=\"\",AD9,INDEX(Shift_Codes,IF(MATCH(AE9,Shift_Codes,0)+1>COUNTA(Shift_Codes),1,MATCH(AE9,Shift_Codes,0)+1))))","v":""},{"$f":"IF(OR($C9=\"\",AG$7=\"\"),\"\",IF(AF9=\"\",AE9,INDEX(Shift_Codes,IF(MATCH(AF9,Shift_Codes,0)+1>COUNTA(Shift_Codes),1,MATCH(AF9,Shift_Codes,0)+1))))","v":""},{"$f":"IF(OR($C9=\"\",AH$7=\"\"),\"\",IF(AG9=\"\",AF9,INDEX(Shift_Codes,IF(MATCH(AG9,Shift_Codes,0)+1>COUNTA(Shift_Codes),1,MATCH(AG9,Shift_Codes,0)+1))))","v":""},{"$f":"IF(OR($C9=\"\",AI$7=\"\"),\"\",IF(AH9=\"\",AG9,INDEX(Shift_Codes,IF(MATCH(AH9,Shift_Codes,0)+1>COUNTA(Shift_Codes),1,MATCH(AH9,Shift_Codes,0)+1))))","v":""},null,{"$f":"COUNTIF($E9:$AI9,\"D*\")","v":0},{"$f":"COUNTIF($E9:$AI9,\"N*\")","v":0}]
[null,"Terry",null,null,{"$f":"IF(OR($C10=\"\",E$7=\"\"),\"\",IF(D10=\"\",C10,INDEX(Shift_Codes,IF(MATCH(D10,Shift_Codes,0)+1>COUNTA(Shift_Codes),1,MATCH(D10,Shift_Codes,0)+1))))","v":""},{"$f":"IF(OR($C10=\"\",F$7=\"\"),\"\",IF(E10=\"\",D10,INDEX(Shift_Codes,IF(MATCH(E10,Shift_Codes,0)+1>COUNTA(Shift_Codes),1,MATCH(E10,Shift_Codes,0)+1))))","v":""},{"$f":"IF(OR($C10=\"\",G$7=\"\"),\"\",IF(F10=\"\",E10,INDEX(Shift_Codes,IF(MATCH(F10,Shift_Codes,0)+1>COUNTA(Shift_Codes),1,MATCH(F10,Shift_Codes,0)+1))))","v":""},{"$f":"IF(OR($C10=\"\",H$7=\"\"),\"\",IF(G10=\"\",F10,INDEX(Shift_Codes,IF(MATCH(G10,Shift_Codes,0)+1>COUNTA(Shift_Codes),1,MATCH(G10,Shift_Codes,0)+1))))","v":""},{"$f":"IF(OR($C10=\"\",I$7=\"\"),\"\",IF(H10=\"\",G10,INDEX(Shift_Codes,IF(MATCH(H10,Shift_Codes,0)+1>COUNTA(Shift_Codes),1,MATCH(H10,Shift_Codes,0)+1))))","v":""},{"$f":"IF(OR($C10=\"\",J$7=\"\"),\"\",IF(I10=\"\",H10,INDEX(Shift_Codes,IF(MATCH(I10,Shift_Codes,0)+1>COUNTA(Shift_Codes),1,MATCH(I10,Shift_Codes,0)+1))))","v":""},{"$f":"IF(OR($C10=\"\",K$7=\"\"),\"\",IF(J10=\"\",I10,INDEX(Shift_Codes,IF(MATCH(J10,Shift_Codes,0)+1>COUNTA(Shift_Codes),1,MATCH(J10,Shift_Codes,0)+1))))","v":""},{"$f":"IF(OR($C10=\"\",L$7=\"\"),\"\",IF(K10=\"\",J10,INDEX(Shift_Codes,IF(MATCH(K10,Shift_Codes,0)+1>COUNTA(Shift_Codes),1,MATCH(K10,Shift_Codes,0)+1))))","v":""},{"$f":"IF(OR($C10=\"\",M$7=\"\"),\"\",IF(L10=\"\",K10,INDEX(Shift_Codes,IF(MATCH(L10,Shift_Codes,0)+1>COUNTA(Shift_Codes),1,MATCH(L10,Shift_Codes,0)+1))))","v":""},{"$f":"IF(OR($C10=\"\",N$7=\"\"),\"\",IF(M10=\"\",L10,INDEX(Shift_Codes,IF(MATCH(M10,Shift_Codes,0)+1>COUNTA(Shift_Codes),1,MATCH(M10,Shift_Codes,0)+1))))","v":""},{"$f":"IF(OR($C10=\"\",O$7=\"\"),\"\",IF(N10=\"\",M10,INDEX(Shift_Codes,IF(MATCH(N10,Shift_Codes,0)+1>COUNTA(Shift_Codes),1,MATCH(N10,Shift_Codes,0)+1))))","v":""},{"$f":"IF(OR($C10=\"\",P$7=\"\"),\"\",IF(O10=\"\",N10,INDEX(Shift_Codes,IF(MATCH(O10,Shift_Codes,0)+1>COUNTA(Shift_Codes),1,MATCH(O10,Shift_Codes,0)+1))))","v":""},{"$f":"IF(OR($C10=\"\",Q$7=\"\"),\"\",IF(P10=\"\",O10,INDEX(Shift_Codes,IF(MATCH(P10,Shift_Codes,0)+1>COUNTA(Shift_Codes),1,MATCH(P10,Shift_Codes,0)+1))))","v":""},{"$f":"IF(OR($C10=\"\",R$7=\"\"),\"\",IF(Q10=\"\",P10,INDEX(Shift_Codes,IF(MATCH(Q10,Shift_Codes,0)+1>COUNTA(Shift_Codes),1,MATCH(Q10,Shift_Codes,0)+1))))","v":""},{"$f":"IF(OR($C10=\"\",S$7=\"\"),\"\",IF(R10=\"\",Q10,INDEX(Shift_Codes,IF(MATCH(R10,Shift_Codes,0)+1>COUNTA(Shift_Codes),1,MATCH(R10,Shift_Codes,0)+1))))","v":""},{"$f":"IF(OR($C10=\"\",T$7=\"\"),\"\",IF(S10=\"\",R10,INDEX(Shift_Codes,IF(MATCH(S10,Shift_Codes,0)+1>COUNTA(Shift_Codes),1,MATCH(S10,Shift_Codes,0)+1))))","v":""},{"$f":"IF(OR($C10=\"\",U$7=\"\"),\"\",IF(T10=\"\",S10,INDEX(Shift_Codes,IF(MATCH(T10,Shift_Codes,0)+1>COUNTA(Shift_Codes),1,MATCH(T10,Shift_Codes,0)+1))))","v":""},{"$f":"IF(OR($C10=\"\",V$7=\"\"),\"\",IF(U10=\"\",T10,INDEX(Shift_Codes,IF(MATCH(U10,Shift_Codes,0)+1>COUNTA(Shift_Codes),1,MATCH(U10,Shift_Codes,0)+1))))","v":""},{"$f":"IF(OR($C10=\"\",W$7=\"\"),\"\",IF(V10=\"\",U10,INDEX(Shift_Codes,IF(MATCH(V10,Shift_Codes,0)+1>COUNTA(Shift_Codes),1,MATCH(V10,Shift_Codes,0)+1))))","v":""},{"$f":"IF(OR($C10=\"\",X$7=\"\"),\"\",IF(W10=\"\",V10,INDEX(Shift_Codes,IF(MATCH(W10,Shift_Codes,0)+1>COUNTA(Shift_Codes),1,MATCH(W10,Shift_Codes,0)+1))))","v":""},{"$f":"IF(OR($C10=\"\",Y$7=\"\"),\"\",IF(X10=\"\",W10,INDEX(Shift_Codes,IF(MATCH(X10,Shift_Codes,0)+1>COUNTA(Shift_Codes),1,MATCH(X10,Shift_Codes,0)+1))))","v":""},{"$f":"IF(OR($C10=\"\",Z$7=\"\"),\"\",IF(Y10=\"\",X10,INDEX(Shift_Codes,IF(MATCH(Y10,Shift_Codes,0)+1>COUNTA(Shift_Codes),1,MATCH(Y10,Shift_Codes,0)+1))))","v":""},{"$f":"IF(OR($C10=\"\",AA$7=\"\"),\"\",IF(Z10=\"\",Y10,INDEX(Shift_Codes,IF(MATCH(Z10,Shift_Codes,0)+1>COUNTA(Shift_Codes),1,MATCH(Z10,Shift_Codes,0)+1))))","v":""},{"$f":"IF(OR($C10=\"\",AB$7=\"\"),\"\",IF(AA10=\"\",Z10,INDEX(Shift_Codes,IF(MATCH(AA10,Shift_Codes,0)+1>COUNTA(Shift_Codes),1,MATCH(AA10,Shift_Codes,0)+1))))","v":""},{"$f":"IF(OR($C10=\"\",AC$7=\"\"),\"\",IF(AB10=\"\",AA10,INDEX(Shift_Codes,IF(MATCH(AB10,Shift_Codes,0)+1>COUNTA(Shift_Codes),1,MATCH(AB10,Shift_Codes,0)+1))))","v":""},{"$f":"IF(OR($C10=\"\",AD$7=\"\"),\"\",IF(AC10=\"\",AB10,INDEX(Shift_Codes,IF(MATCH(AC10,Shift_Codes,0)+1>COUNTA(Shift_Codes),1,MATCH(AC10,Shift_Codes,0)+1))))","v":""},{"$f":"IF(OR($C10=\"\",AE$7=\"\"),\"\",IF(AD10=\"\",AC10,INDEX(Shift_Codes,IF(MATCH(AD10,Shift_Codes,0)+1>COUNTA(Shift_Codes),1,MATCH(AD10,Shift_Codes,0)+1))))","v":""},{"$f":"IF(OR($C10=\"\",AF$7=\"\"),\"\",IF(AE10=\"\",AD10,INDEX(Shift_Codes,IF(MATCH(AE10,Shift_Codes,0)+1>COUNTA(Shift_Codes),1,MATCH(AE10,Shift_Codes,0)+1))))","v":""},{"$f":"IF(OR($C10=\"\",AG$7=\"\"),\"\",IF(AF10=\"\",AE10,INDEX(Shift_Codes,IF(MATCH(AF10,Shift_Codes,0)+1>COUNTA(Shift_Codes),1,MATCH(AF10,Shift_Codes,0)+1))))","v":""},{"$f":"IF(OR($C10=\"\",AH$7=\"\"),\"\",IF(AG10=\"\",AF10,INDEX(Shift_Codes,IF(MATCH(AG10,Shift_Codes,0)+1>COUNTA(Shift_Codes),1,MATCH(AG10,Shift_Codes,0)+1))))","v":""},{"$f":"IF(OR($C10=\"\",AI$7=\"\"),\"\",IF(AH10=\"\",AG10,INDEX(Shift_Codes,IF(MATCH(AH10,Shift_Codes,0)+1>COUNTA(Shift_Codes),1,MATCH(AH10,Shift_Codes,0)+1))))","v":""},null,0,0]
[null,null,null,null,{"$f":"IF(OR($C11=\"\",E$7=\"\"),\"\",IF(D11=\"\",C11,INDEX(Shift_Codes,IF(MATCH(D11,Shift_Codes,0)+1>COUNTA(Shift_Codes),1,MATCH(D11,Shift_Codes,0)+1))))","v":""},{"$f":"IF(OR($C11=\"\",F$7=\"\"),\"\",IF(E11=\"\",D11,INDEX(Shift_Codes,IF(MATCH(E11,Shift_Codes,0)+1>COUNTA(Shift_Codes),1,MATCH(E11,Shift_Codes,0)+1))))","v":""},{"$f":"IF(OR($C11=\"\",G$7=\"\"),\"\",IF(F11=\"\",E11,INDEX(Shift_Codes,IF(MATCH(F11,Shift_Codes,0)+1>COUNTA(Shift_Codes),1,MATCH(F11,Shift_Codes,0)+1))))","v":""},{"$f":"IF(OR($C11=\"\",H$7=\"\"),\"\",IF(G11=\"\",F11,INDEX(Shift_Codes,IF(MATCH(G11,Shift_Codes,0)+1>COUNTA(Shift_Codes),1,MATCH(G11,Shift_Codes,0)+1))))","v":""},{"$f":"IF(OR($C11=\"\",I$7=\"\"),\"\",IF(H11=\"\",G11,INDEX(Shift_Codes,IF(MATCH(H11,Shift_Codes,0)+1>COUNTA(Shift_Codes),1,MATCH(H11,Shift_Codes,0)+1))))","v":""},{"$f":"IF(OR($C11=\"\",J$7=\"\"),\"\",IF(I11=\"\",H11,INDEX(Shift_Codes,IF(MATCH(I11,Shift_Codes,0)+1>COUNTA(Shift_Codes),1,MATCH(I11,Shift_Codes,0)+1))))","v":""},{"$f":"IF(OR($C11=\"\",K$7=\"\"),\"\",IF(J11=\"\",I11,INDEX(Shift_Codes,IF(MATCH(J11,Shift_Codes,0)+1>COUNTA(Shift_Codes),1,MATCH(J11,Shift_Codes,0)+1))))","v":""},{"$f":"IF(OR($C11=\"\",L$7=\"\"),\"\",IF(K11=\"\",J11,INDEX(Shift_Codes,IF(MATCH(K11,Shift_Codes,0)+1>COUNTA(Shift_Codes),1,MATCH(K11,Shift_Codes,0)+1))))","v":""},{"$f":"IF(OR($C11=\"\",M$7=\"\"),\"\",IF(L11=\"\",K11,INDEX(Shift_Codes,IF(MATCH(L11,Shift_Codes,0)+1>COUNTA(Shift_Codes),1,MATCH(L11,Shift_Codes,0)+1))))","v":""},{"$f":"IF(OR($C11=\"\",N$7=\"\"),\"\",IF(M11=\"\",L11,INDEX(Shift_Codes,IF(MATCH(M11,Shift_Codes,0)+1>COUNTA(Shift_Codes),1,MATCH(M11,Shift_Codes,0)+1))))","v":""},{"$f":"IF(OR($C11=\"\",O$7=\"\"),\"\",IF(N11=\"\",M11,INDEX(Shift_Codes,IF(MATCH(N11,Shift_Codes,0)+1>COUNTA(Shift_Codes),1,MATCH(N11,Shift_Codes,0)+1))))","v":""},{"$f":"IF(OR($C11=\"\",P$7=\"\"),\"\",IF(O11=\"\",N11,INDEX(Shift_Codes,IF(MATCH(O11,Shift_Codes,0)+1>COUNTA(Shift_Codes),1,MATCH(O11,Shift_Codes,0)+1))))","v":""},{"$f":"IF(OR($C11=\"\",Q$7=\"\"),\"\",IF(P11=\"\",O11,INDEX(Shift_Codes,IF(MATCH(P11,Shift_Codes,0)+1>COUNTA(Shift_Codes),1,MATCH(P11,Shift_Codes,0)+1))))","v":""},{"$f":"IF(OR($C11=\"\",R$7=\"\"),\"\",IF(Q11=\"\",P11,INDEX(Shift_Codes,IF(MATCH(Q11,Shift_Codes,0)+1>COUNTA(Shift_Codes),1,MATCH(Q11,Shift_Codes,0)+1))))","v":""},{"$f":"IF(OR($C11=\"\",S$7=\"\"),\"\",IF(R11=\"\",Q11,INDEX(Shift_Codes,IF(MATCH(R11,Shift_Codes,0)+1>COUNTA(Shift_Codes),1,MATCH(R11,Shift_Codes,0)+1))))","v":""},{"$f":"IF(OR($C11=\"\",T$7=\"\"),\"\",IF(S11=\"\",R11,INDEX(Shift_Codes,IF(MATCH(S11,Shift_Codes,0)+1>COUNTA(Shift_Codes),1,MATCH(S11,Shift_Codes,0)+1))))","v":""},{"$f":"IF(OR($C11=\"\",U$7=\"\"),\"\",IF(T11=\"\",S11,INDEX(Shift_Codes,IF(MATCH(T11,Shift_Codes,0)+1>COUNTA(Shift_Codes),1,MATCH(T11,Shift_Codes,0)+1))))","v":""},{"$f":"IF(OR($C11=\"\",V$7=\"\"),\"\",IF(U11=\"\",T11,INDEX(Shift_Codes,IF(MATCH(U11,Shift_Codes,0)+1>COUNTA(Shift_Codes),1,MATCH(U11,Shift_Codes,0)+1))))","v":""},{"$f":"IF(OR($C11=\"\",W$7=\"\"),\"\",IF(V11=\"\",U11,INDEX(Shift_Codes,IF(MATCH(V11,Shift_Codes,0)+1>COUNTA(Shift_Codes),1,MATCH(V11,Shift_Codes,0)+1))))","v":""},{"$f":"IF(OR($C11=\"\",X$7=\"\"),\"\",IF(W11=\"\",V11,INDEX(Shift_Codes,IF(MATCH(W11,Shift_Codes,0)+1>COUNTA(Shift_Codes),1,MATCH(W11,Shift_Codes,0)+1))))","v":""},{"$f":"IF(OR($C11=\"\",Y$7=\"\"),\"\",IF(X11=\"\",W11,INDEX(Shift_Codes,IF(MATCH(X11,Shift_Codes,0)+1>COUNTA(Shift_Codes),1,MATCH(X11,Shift_Codes,0)+1))))","v":""},{"$f":"IF(OR($C11=\"\",Z$7=\"\"),\"\",IF(Y11=\"\",X11,INDEX(Shift_Codes,IF(MATCH(Y11,Shift_Codes,0)+1>COUNTA(Shift_Codes),1,MATCH(Y11,Shift_Codes,0)+1))))","v":""},{"$f":"IF(OR($C11=\"\",AA$7=\"\"),\"\",IF(Z11=\"\",Y11,INDEX(Shift_Codes,IF(MATCH(Z11,Shift_Codes,0)+1>COUNTA(Shift_Codes),1,MATCH(Z11,Shift_Codes,0)+1))))","v":""},{"$f":"IF(OR($C11=\"\",AB$7=\"\"),\"\",IF(AA11=\"\",Z11,INDEX(Shift_Codes,IF(MATCH(AA11,Shift_Codes,0)+1>COUNTA(Shift_Codes),1,MATCH(AA11,Shift_Codes,0)+1))))","v":""},{"$f":"IF(OR($C11=\"\",AC$7=\"\"),\"\",IF(AB11=\"\",AA11,INDEX(Shift_Codes,IF(MATCH(AB11,Shift_Codes,0)+1>COUNTA(Shift_Codes),1,MATCH(AB11,Shift_Codes,0)+1))))","v":""},{"$f":"IF(OR($C11=\"\",AD$7=\"\"),\"\",IF(AC11=\"\",AB11,INDEX(Shift_Codes,IF(MATCH(AC11,Shift_Codes,0)+1>COUNTA(Shift_Codes),1,MATCH(AC11,Shift_Codes,0)+1))))","v":""},{"$f":"IF(OR($C11=\"\",AE$7=\"\"),\"\",IF(AD11=\"\",AC11,INDEX(Shift_Codes,IF(MATCH(AD11,Shift_Codes,0)+1>COUNTA(Shift_Codes),1,MATCH(AD11,Shift_Codes,0)+1))))","v":""},{"$f":"IF(OR($C11=\"\",AF$7=\"\"),\"\",IF(AE11=\"\",AD11,INDEX(Shift_Codes,IF(MATCH(AE11,Shift_Codes,0)+1>COUNTA(Shift_Codes),1,MATCH(AE11,Shift_Codes,0)+1))))","v":""},{"$f":"IF(OR($C11=\"\",AG$7=\"\"),\"\",IF(AF11=\"\",AE11,INDEX(Shift_Codes,IF(MATCH(AF11,Shift_Codes,0)+1>COUNTA(Shift_Codes),1,MATCH(AF11,Shift_Codes,0)+1))))","v":""},{"$f":"IF(OR($C11=\"\",AH$7=\"\"),\"\",IF(AG11=\"\",AF11,INDEX(Shift_Codes,IF(MATCH(AG11,Shift_Codes,0)+1>COUNTA(Shift_Codes),1,MATCH(AG11,Shift_Codes,0)+1))))","v":""},{"$f":"IF(OR($C11=\"\",AI$7=\"\"),\"\",IF(AH11=\"\",AG11,INDEX(Shift_Codes,IF(MATCH(AH11,Shift_Codes,0)+1>COUNTA(Shift_Codes),1,MATCH(AH11,Shift_Codes,0)+1))))","v":""},null,0,0]
[null,null,null,null,{"$f":"IF(OR($C12=\"\",E$7=\"\"),\"\",IF(D12=\"\",C12,INDEX(Shift_Codes,IF(MATCH(D12,Shift_Codes,0)+1>COUNTA(Shift_Codes),1,MATCH(D12,Shift_Codes,0)+1))))","v":""},{"$f":"IF(OR($C12=\"\",F$7=\"\"),\"\",IF(E12=\"\",D12,INDEX(Shift_Codes,IF(MATCH(E12,Shift_Codes,0)+1>COUNTA(Shift_Codes),1,MATCH(E12,Shift_Codes,0)+1))))","v":""},{"$f":"IF(OR($C12=\"\",G$7=\"\"),\"\",IF(F12=\"\",E12,INDEX(Shift_Codes,IF(MATCH(F12,Shift_Codes,0)+1>COUNTA(Shift_Codes),1,MATCH(F12,Shift_Codes,0)+1))))","v":""},{"$f":"IF(OR($C12=\"\",H$7=\"\"),\"\",IF(G12=\"\",F12,INDEX(Shift_Codes,IF(MATCH(G12,Shift_Codes,0)+1>COUNTA(Shift_Codes),1,MATCH(G12,Shift_Codes,0)+1))))","v":""},{"$f":"IF(OR($C12=\"\",I$7=\"\"),\"\",IF(H12=\"\",G12,INDEX(Shift_Codes,IF(MATCH(H12,Shift_Codes,0)+1>COUNTA(Shift_Codes),1,MATCH(H12,Shift_Codes,0)+1))))","v":""},{"$f":"IF(OR($C12=\"\",J$7=\"\"),\"\",IF(I12=\"\",H12,INDEX(Shift_Codes,IF(MATCH(I12,Shift_Codes,0)+1>COUNTA(Shift_Codes),1,MATCH(I12,Shift_Codes,0)+1))))","v":""},{"$f":"IF(OR($C12=\"\",K$7=\"\"),\"\",IF(J12=\"\",I12,INDEX(Shift_Codes,IF(MATCH(J12,Shift_Codes,0)+1>COUNTA(Shift_Codes),1,MATCH(J12,Shift_Codes,0)+1))))","v":""},{"$f":"IF(OR($C12=\"\",L$7=\"\"),\"\",IF(K12=\"\",J12,INDEX(Shift_Codes,IF(MATCH(K12,Shift_Codes,0)+1>COUNTA(Shift_Codes),1,MATCH(K12,Shift_Codes,0)+1))))","v":""},{"$f":"IF(OR($C12=\"\",M$7=\"\"),\"\",IF(L12=\"\",K12,INDEX(Shift_Codes,IF(MATCH(L12,Shift_Codes,0)+1>COUNTA(Shift_Codes),1,MATCH(L12,Shift_Codes,0)+1))))","v":""},{"$f":"IF(OR($C12=\"\",N$7=\"\"),\"\",IF(M12=\"\",L12,INDEX(Shift_Codes,IF(MATCH(M12,Shift_Codes,0)+1>COUNTA(Shift_Codes),1,MATCH(M12,Shift_Codes,0)+1))))","v":""},{"$f":"IF(OR($C12=\"\",O$7=\"\"),\"\",IF(N12=\"\",M12,INDEX(Shift_Codes,IF(MATCH(N12,Shift_Codes,0)+1>COUNTA(Shift_Codes),1,MATCH(N12,Shift_Codes,0)+1))))","v":""},{"$f":"IF(OR($C12=\"\",P$7=\"\"),\"\",IF(O12=\"\",N12,INDEX(Shift_Codes,IF(MATCH(O12,Shift_Codes,0)+1>COUNTA(Shift_Codes),1,MATCH(O12,Shift_Codes,0)+1))))","v":""},{"$f":"IF(OR($C12=\"\",Q$7=\"\"),\"\",IF(P12=\"\",O12,INDEX(Shift_Codes,IF(MATCH(P12,Shift_Codes,0)+1>COUNTA(Shift_Codes),1,MATCH(P12,Shift_Codes,0)+1))))","v":""},{"$f":"IF(OR($C12=\"\",R$7=\"\"),\"\",IF(Q12=\"\",P12,INDEX(Shift_Codes,IF(MATCH(Q12,Shift_Codes,0)+1>COUNTA(Shift_Codes),1,MATCH(Q12,Shift_Codes,0)+1))))","v":""},{"$f":"IF(OR($C12=\"\",S$7=\"\"),\"\",IF(R12=\"\",Q12,INDEX(Shift_Codes,IF(MATCH(R12,Shift_Codes,0)+1>COUNTA(Shift_Codes),1,MATCH(R12,Shift_Codes,0)+1))))","v":""},{"$f":"IF(OR($C12=\"\",T$7=\"\"),\"\",IF(S12=\"\",R12,INDEX(Shift_Codes,IF(MATCH(S12,Shift_Codes,0)+1>COUNTA(Shift_Codes),1,MATCH(S12,Shift_Codes,0)+1))))","v":""},{"$f":"IF(OR($C12=\"\",U$7=\"\"),\"\",IF(T12=\"\",S12,INDEX(Shift_Codes,IF(MATCH(T12,Shift_Codes,0)+1>COUNTA(Shift_Codes),1,MATCH(T12,Shift_Codes,0)+1))))","v":""},{"$f":"IF(OR($C12=\"\",V$7=\"\"),\"\",IF(U12=\"\",T12,INDEX(Shift_Codes,IF(MATCH(U12,Shift_Codes,0)+1>COUNTA(Shift_Codes),1,MATCH(U12,Shift_Codes,0)+1))))","v":""},{"$f":"IF(OR($C12=\"\",W$7=\"\"),\"\",IF(V12=\"\",U12,INDEX(Shift_Codes,IF(MATCH(V12,Shift_Codes,0)+1>COUNTA(Shift_Codes),1,MATCH(V12,Shift_Codes,0)+1))))","v":""},{"$f":"IF(OR($C12=\"\",X$7=\"\"),\"\",IF(W12=\"\",V12,INDEX(Shift_Codes,IF(MATCH(W12,Shift_Codes,0)+1>COUNTA(Shift_Codes),1,MATCH(W12,Shift_Codes,0)+1))))","v":""},{"$f":"IF(OR($C12=\"\",Y$7=\"\"),\"\",IF(X12=\"\",W12,INDEX(Shift_Codes,IF(MATCH(X12,Shift_Codes,0)+1>COUNTA(Shift_Codes),1,MATCH(X12,Shift_Codes,0)+1))))","v":""},{"$f":"IF(OR($C12=\"\",Z$7=\"\"),\"\",IF(Y12=\"\",X12,INDEX(Shift_Codes,IF(MATCH(Y12,Shift_Codes,0)+1>COUNTA(Shift_Codes),1,MATCH(Y12,Shift_Codes,0)+1))))","v":""},{"$f":"IF(OR($C12=\"\",AA$7=\"\"),\"\",IF(Z12=\"\",Y12,INDEX(Shift_Codes,IF(MATCH(Z12,Shift_Codes,0)+1>COUNTA(Shift_Codes),1,MATCH(Z12,Shift_Codes,0)+1))))","v":""},{"$f":"IF(OR($C12=\"\",AB$7=\"\"),\"\",IF(AA12=\"\",Z12,INDEX(Shift_Codes,IF(MATCH(AA12,Shift_Codes,0)+1>COUNTA(Shift_Codes),1,MATCH(AA12,Shift_Codes,0)+1))))","v":""},{"$f":"IF(OR($C12=\"\",AC$7=\"\"),\"\",IF(AB12=\"\",AA12,INDEX(Shift_Codes,IF(MATCH(AB12,Shift_Codes,0)+1>COUNTA(Shift_Codes),1,MATCH(AB12,Shift_Codes,0)+1))))","v":""},{"$f":"IF(OR($C12=\"\",AD$7=\"\"),\"\",IF(AC12=\"\",AB12,INDEX(Shift_Codes,IF(MATCH(AC12,Shift_Codes,0)+1>COUNTA(Shift_Codes),1,MATCH(AC12,Shift_Codes,0)+1))))","v":""},{"$f":"IF(OR($C12=\"\",AE$7=\"\"),\"\",IF(AD12=\"\",AC12,INDEX(Shift_Codes,IF(MATCH(AD12,Shift_Codes,0)+1>COUNTA(Shift_Codes),1,MATCH(AD12,Shift_Codes,0)+1))))","v":""},{"$f":"IF(OR($C12=\"\",AF$7=\"\"),\"\",IF(AE12=\"\",AD12,INDEX(Shift_Codes,IF(MATCH(AE12,Shift_Codes,0)+1>COUNTA(Shift_Codes),1,MATCH(AE12,Shift_Codes,0)+1))))","v":""},{"$f":"IF(OR($C12=\"\",AG$7=\"\"),\"\",IF(AF12=\"\",AE12,INDEX(Shift_Codes,IF(MATCH(AF12,Shift_Codes,0)+1>COUNTA(Shift_Codes),1,MATCH(AF12,Shift_Codes,0)+1))))","v":""},{"$f":"IF(OR($C12=\"\",AH$7=\"\"),\"\",IF(AG12=\"\",AF12,INDEX(Shift_Codes,IF(MATCH(AG12,Shift_Codes,0)+1>COUNTA(Shift_Codes),1,MATCH(AG12,Shift_Codes,0)+1))))","v":""},{"$f":"IF(OR($C12=\"\",AI$7=\"\"),\"\",IF(AH12=\"\",AG12,INDEX(Shift_Codes,IF(MATCH(AH12,Shift_Codes,0)+1>COUNTA(Shift_Codes),1,MATCH(AH12,Shift_Codes,0)+1))))","v":""},null,0,0]
[null,null,null,null,{"$f":"IF(OR($C13=\"\",E$7=\"\"),\"\",IF(D13=\"\",C13,INDEX(Shift_Codes,IF(MATCH(D13,Shift_Codes,0)+1>COUNTA(Shift_Codes),1,MATCH(D13,Shift_Codes,0)+1))))","v":""},{"$f":"IF(OR($C13=\"\",F$7=\"\"),\"\",IF(E13=\"\",D13,INDEX(Shift_Codes,IF(MATCH(E13,Shift_Codes,0)+1>COUNTA(Shift_Codes),1,MATCH(E13,Shift_Codes,0)+1))))","v":""},{"$f":"IF(OR($C13=\"\",G$7=\"\"),\"\",IF(F13=\"\",E13,INDEX(Shift_Codes,IF(MATCH(F13,Shift_Codes,0)+1>COUNTA(Shift_Codes),1,MATCH(F13,Shift_Codes,0)+1))))","v":""},{"$f":"IF(OR($C13=\"\",H$7=\"\"),\"\",IF(G13=\"\",F13,INDEX(Shift_Codes,IF(MATCH(G13,Shift_Codes,0)+1>COUNTA(Shift_Codes),1,MATCH(G13,Shift_Codes,0)+1))))","v":""},{"$f":"IF(OR($C13=\"\",I$7=\"\"),\"\",IF(H13=\"\",G13,INDEX(Shift_Codes,IF(MATCH(H13,Shift_Codes,0)+1>COUNTA(Shift_Codes),1,MATCH(H13,Shift_Codes,0)+1))))","v":""},{"$f":"IF(OR($C13=\"\",J$7=\"\"),\"\",IF(I13=\"\",H13,INDEX(Shift_Codes,IF(MATCH(I13,Shift_Codes,0)+1>COUNTA(Shift_Codes),1,MATCH(I13,Shift_Codes,0)+1))))","v":""},{"$f":"IF(OR($C13=\"\",K$7=\"\"),\"\",IF(J13=\"\",I13,INDEX(Shift_Codes,IF(MATCH(J13,Shift_Codes,0)+1>COUNTA(Shift_Codes),1,MATCH(J13,Shift_Codes,0)+1))))","v":""},{"$f":"IF(OR($C13=\"\",L$7=\"\"),\"\",IF(K13=\"\",J13,INDEX(Shift_Codes,IF(MATCH(K13,Shift_Codes,0)+1>COUNTA(Shift_Codes),1,MATCH(K13,Shift_Codes,0)+1))))","v":""},{"$f":"IF(OR($C13=\"\",M$7=\"\"),\"\",IF(L13=\"\",K13,INDEX(Shift_Codes,IF(MATCH(L13,Shift_Codes,0)+1>COUNTA(Shift_Codes),1,MATCH(L13,Shift_Codes,0)+1))))","v":""},{"$f":"IF(OR($C13=\"\",N$7=\"\"),\"\",IF(M13=\"\",L13,INDEX(Shift_Codes,IF(MATCH(M13,Shift_Codes,0)+1>COUNTA(Shift_Codes),1,MATCH(M13,Shift_Codes,0)+1))))","v":""},{"$f":"IF(OR($C13=\"\",O$7=\"\"),\"\",IF(N13=\"\",M13,INDEX(Shift_Codes,IF(MATCH(N13,Shift_Codes,0)+1>COUNTA(Shift_Codes),1,MATCH(N13,Shift_Codes,0)+1))))","v":""},{"$f":"IF(OR($C13=\"\",P$7=\"\"),\"\",IF(O13=\"\",N13,INDEX(Shift_Codes,IF(MATCH(O13,Shift_Codes,0)+1>COUNTA(Shift_Codes),1,MATCH(O13,Shift_Codes,0)+1))))","v":""},{"$f":"IF(OR($C13=\"\",Q$7=\"\"),\"\",IF(P13=\"\",O13,INDEX(Shift_Codes,IF(MATCH(P13,Shift_Codes,0)+1>COUNTA(Shift_Codes),1,MATCH(P13,Shift_Codes,0)+1))))","v":""},{"$f":"IF(OR($C13=\"\",R$7=\"\"),\"\",IF(Q13=\"\",P13,INDEX(Shift_Codes,IF(MATCH(Q13,Shift_Codes,0)+1>COUNTA(Shift_Codes),1,MATCH(Q13,Shift_Codes,0)+1))))","v":""},{"$f":"IF(OR($C13=\"\",S$7=\"\"),\"\",IF(R13=\"\",Q13,INDEX(Shift_Codes,IF(MATCH(R13,Shift_Codes,0)+1>COUNTA(Shift_Codes),1,MATCH(R13,Shift_Codes,0)+1))))","v":""},{"$f":"IF(OR($C13=\"\",T$7=\"\"),\"\",IF(S13=\"\",R13,INDEX(Shift_Codes,IF(MATCH(S13,Shift_Codes,0)+1>COUNTA(Shift_Codes),1,MATCH(S13,Shift_Codes,0)+1))))","v":""},{"$f":"IF(OR($C13=\"\",U$7=\"\"),\"\",IF(T13=\"\",S13,INDEX(Shift_Codes,IF(MATCH(T13,Shift_Codes,0)+1>COUNTA(Shift_Codes),1,MATCH(T13,Shift_Codes,0)+1))))","v":""},{"$f":"IF(OR($C13=\"\",V$7=\"\"),\"\",IF(U13=\"\",T13,INDEX(Shift_Codes,IF(MATCH(U13,Shift_Codes,0)+1>COUNTA(Shift_Codes),1,MATCH(U13,Shift_Codes,0)+1))))","v":""},{"$f":"IF(OR($C13=\"\",W$7=\"\"),\"\",IF(V13=\"\",U13,INDEX(Shift_Codes,IF(MATCH(V13,Shift_Codes,0)+1>COUNTA(Shift_Codes),1,MATCH(V13,Shift_Codes,0)+1))))","v":""},{"$f":"IF(OR($C13=\"\",X$7=\"\"),\"\",IF(W13=\"\",V13,INDEX(Shift_Codes,IF(MATCH(W13,Shift_Codes,0)+1>COUNTA(Shift_Codes),1,MATCH(W13,Shift_Codes,0)+1))))","v":""},{"$f":"IF(OR($C13=\"\",Y$7=\"\"),\"\",IF(X13=\"\",W13,INDEX(Shift_Codes,IF(MATCH(X13,Shift_Codes,0)+1>COUNTA(Shift_Codes),1,MATCH(X13,Shift_Codes,0)+1))))","v":""},{"$f":"IF(OR($C13=\"\",Z$7=\"\"),\"\",IF(Y13=\"\",X13,INDEX(Shift_Codes,IF(MATCH(Y13,Shift_Codes,0)+1>COUNTA(Shift_Codes),1,MATCH(Y13,Shift_Codes,0)+1))))","v":""},{"$f":"IF(OR($C13=\"\",AA$7=\"\"),\"\",IF(Z13=\"\",Y13,INDEX(Shift_Codes,IF(MATCH(Z13,Shift_Codes,0)+1>COUNTA(Shift_Codes),1,MATCH(Z13,Shift_Codes,0)+1))))","v":""},{"$f":"IF(OR($C13=\"\",AB$7=\"\"),\"\",IF(AA13=\"\",Z13,INDEX(Shift_Codes,IF(MATCH(AA13,Shift_Codes,0)+1>COUNTA(Shift_Codes),1,MATCH(AA13,Shift_Codes,0)+1))))","v":""},{"$f":"IF(OR($C13=\"\",AC$7=\"\"),\"\",IF(AB13=\"\",AA13,INDEX(Shift_Codes,IF(MATCH(AB13,Shift_Codes,0)+1>COUNTA(Shift_Codes),1,MATCH(AB13,Shift_Codes,0)+1))))","v":""},{"$f":"IF(OR($C13=\"\",AD$7=\"\"),\"\",IF(AC13=\"\",AB13,INDEX(Shift_Codes,IF(MATCH(AC13,Shift_Codes,0)+1>COUNTA(Shift_Codes),1,MATCH(AC13,Shift_Codes,0)+1))))","v":""},{"$f":"IF(OR($C13=\"\",AE$7=\"\"),\"\",IF(AD13=\"\",AC13,INDEX(Shift_Codes,IF(MATCH(AD13,Shift_Codes,0)+1>COUNTA(Shift_Codes),1,MATCH(AD13,Shift_Codes,0)+1))))","v":""},{"$f":"IF(OR($C13=\"\",AF$7=\"\"),\"\",IF(AE13=\"\",AD13,INDEX(Shift_Codes,IF(MATCH(AE13,Shift_Codes,0)+1>COUNTA(Shift_Codes),1,MATCH(AE13,Shift_Codes,0)+1))))","v":""},{"$f":"IF(OR($C13=\"\",AG$7=\"\"),\"\",IF(AF13=\"\",AE13,INDEX(Shift_Codes,IF(MATCH(AF13,Shift_Codes,0)+1>COUNTA(Shift_Codes),1,MATCH(AF13,Shift_Codes,0)+1))))","v":""},{"$f":"IF(OR($C13=\"\",AH$7=\"\"),\"\",IF(AG13=\"\",AF13,INDEX(Shift_Codes,IF(MATCH(AG13,Shift_Codes,0)+1>COUNTA(Shift_Codes),1,MATCH(AG13,Shift_Codes,0)+1))))","v":""},{"$f":"IF(OR($C13=\"\",AI$7=\"\"),\"\",IF(AH13=\"\",AG13,INDEX(Shift_Codes,IF(MATCH(AH13,Shift_Codes,0)+1>COUNTA(Shift_Codes),1,MATCH(AH13,Shift_Codes,0)+1))))","v":""},null,0,0]
[null,null,null,null,{"$f":"IF(OR($C14=\"\",E$7=\"\"),\"\",IF(D14=\"\",C14,INDEX(Shift_Codes,IF(MATCH(D14,Shift_Codes,0)+1>COUNTA(Shift_Codes),1,MATCH(D14,Shift_Codes,0)+1))))","v":""},{"$f":"IF(OR($C14=\"\",F$7=\"\"),\"\",IF(E14=\"\",D14,INDEX(Shift_Codes,IF(MATCH(E14,Shift_Codes,0)+1>COUNTA(Shift_Codes),1,MATCH(E14,Shift_Codes,0)+1))))","v":""},{"$f":"IF(OR($C14=\"\",G$7=\"\"),\"\",IF(F14=\"\",E14,INDEX(Shift_Codes,IF(MATCH(F14,Shift_Codes,0)+1>COUNTA(Shift_Codes),1,MATCH(F14,Shift_Codes,0)+1))))","v":""},{"$f":"IF(OR($C14=\"\",H$7=\"\"),\"\",IF(G14=\"\",F14,INDEX(Shift_Codes,IF(MATCH(G14,Shift_Codes,0)+1>COUNTA(Shift_Codes),1,MATCH(G14,Shift_Codes,0)+1))))","v":""},{"$f":"IF(OR($C14=\"\",I$7=\"\"),\"\",IF(H14=\"\",G14,INDEX(Shift_Codes,IF(MATCH(H14,Shift_Codes,0)+1>COUNTA(Shift_Codes),1,MATCH(H14,Shift_Codes,0)+1))))","v":""},{"$f":"IF(OR($C14=\"\",J$7=\"\"),\"\",IF(I14=\"\",H14,INDEX(Shift_Codes,IF(MATCH(I14,Shift_Codes,0)+1>COUNTA(Shift_Codes),1,MATCH(I14,Shift_Codes,0)+1))))","v":""},{"$f":"IF(OR($C14=\"\",K$7=\"\"),\"\",IF(J14=\"\",I14,INDEX(Shift_Codes,IF(MATCH(J14,Shift_Codes,0)+1>COUNTA(Shift_Codes),1,MATCH(J14,Shift_Codes,0)+1))))","v":""},{"$f":"IF(OR($C14=\"\",L$7=\"\"),\"\",IF(K14=\"\",J14,INDEX(Shift_Codes,IF(MATCH(K14,Shift_Codes,0)+1>COUNTA(Shift_Codes),1,MATCH(K14,Shift_Codes,0)+1))))","v":""},{"$f":"IF(OR($C14=\"\",M$7=\"\"),\"\",IF(L14=\"\",K14,INDEX(Shift_Codes,IF(MATCH(L14,Shift_Codes,0)+1>COUNTA(Shift_Codes),1,MATCH(L14,Shift_Codes,0)+1))))","v":""},{"$f":"IF(OR($C14=\"\",N$7=\"\"),\"\",IF(M14=\"\",L14,INDEX(Shift_Codes,IF(MATCH(M14,Shift_Codes,0)+1>COUNTA(Shift_Codes),1,MATCH(M14,Shift_Codes,0)+1))))","v":""},{"$f":"IF(OR($C14=\"\",O$7=\"\"),\"\",IF(N14=\"\",M14,INDEX(Shift_Codes,IF(MATCH(N14,Shift_Codes,0)+1>COUNTA(Shift_Codes),1,MATCH(N14,Shift_Codes,0)+1))))","v":""},{"$f":"IF(OR($C14=\"\",P$7=\"\"),\"\",IF(O14=\"\",N14,INDEX(Shift_Codes,IF(MATCH(O14,Shift_Codes,0)+1>COUNTA(Shift_Codes),1,MATCH(O14,Shift_Codes,0)+1))))","v":""},{"$f":"IF(OR($C14=\"\",Q$7=\"\"),\"\",IF(P14=\"\",O14,INDEX(Shift_Codes,IF(MATCH(P14,Shift_Codes,0)+1>COUNTA(Shift_Codes),1,MATCH(P14,Shift_Codes,0)+1))))","v":""},{"$f":"IF(OR($C14=\"\",R$7=\"\"),\"\",IF(Q14=\"\",P14,INDEX(Shift_Codes,IF(MATCH(Q14,Shift_Codes,0)+1>COUNTA(Shift_Codes),1,MATCH(Q14,Shift_Codes,0)+1))))","v":""},{"$f":"IF(OR($C14=\"\",S$7=\"\"),\"\",IF(R14=\"\",Q14,INDEX(Shift_Codes,IF(MATCH(R14,Shift_Codes,0)+1>COUNTA(Shift_Codes),1,MATCH(R14,Shift_Codes,0)+1))))","v":""},{"$f":"IF(OR($C14=\"\",T$7=\"\"),\"\",IF(S14=\"\",R14,INDEX(Shift_Codes,IF(MATCH(S14,Shift_Codes,0)+1>COUNTA(Shift_Codes),1,MATCH(S14,Shift_Codes,0)+1))))","v":""},{"$f":"IF(OR($C14=\"\",U$7=\"\"),\"\",IF(T14=\"\",S14,INDEX(Shift_Codes,IF(MATCH(T14,Shift_Codes,0)+1>COUNTA(Shift_Codes),1,MATCH(T14,Shift_Codes,0)+1))))","v":""},{"$f":"IF(OR($C14=\"\",V$7=\"\"),\"\",IF(U14=\"\",T14,INDEX(Shift_Codes,IF(MATCH(U14,Shift_Codes,0)+1>COUNTA(Shift_Codes),1,MATCH(U14,Shift_Codes,0)+1))))","v":""},{"$f":"IF(OR($C14=\"\",W$7=\"\"),\"\",IF(V14=\"\",U14,INDEX(Shift_Codes,IF(MATCH(V14,Shift_Codes,0)+1>COUNTA(Shift_Codes),1,MATCH(V14,Shift_Codes,0)+1))))","v":""},{"$f":"IF(OR($C14=\"\",X$7=\"\"),\"\",IF(W14=\"\",V14,INDEX(Shift_Codes,IF(MATCH(W14,Shift_Codes,0)+1>COUNTA(Shift_Codes),1,MATCH(W14,Shift_Codes,0)+1))))","v":""},{"$f":"IF(OR($C14=\"\",Y$7=\"\"),\"\",IF(X14=\"\",W14,INDEX(Shift_Codes,IF(MATCH(X14,Shift_Codes,0)+1>COUNTA(Shift_Codes),1,MATCH(X14,Shift_Codes,0)+1))))","v":""},{"$f":"IF(OR($C14=\"\",Z$7=\"\"),\"\",IF(Y14=\"\",X14,INDEX(Shift_Codes,IF(MATCH(Y14,Shift_Codes,0)+1>COUNTA(Shift_Codes),1,MATCH(Y14,Shift_Codes,0)+1))))","v":""},{"$f":"IF(OR($C14=\"\",AA$7=\"\"),\"\",IF(Z14=\"\",Y14,INDEX(Shift_Codes,IF(MATCH(Z14,Shift_Codes,0)+1>COUNTA(Shift_Codes),1,MATCH(Z14,Shift_Codes,0)+1))))","v":""},{"$f":"IF(OR($C14=\"\",AB$7=\"\"),\"\",IF(AA14=\"\",Z14,INDEX(Shift_Codes,IF(MATCH(AA14,Shift_Codes,0)+1>COUNTA(Shift_Codes),1,MATCH(AA14,Shift_Codes,0)+1))))","v":""},{"$f":"IF(OR($C14=\"\",AC$7=\"\"),\"\",IF(AB14=\"\",AA14,INDEX(Shift_Codes,IF(MATCH(AB14,Shift_Codes,0)+1>COUNTA(Shift_Codes),1,MATCH(AB14,Shift_Codes,0)+1))))","v":""},{"$f":"IF(OR($C14=\"\",AD$7=\"\"),\"\",IF(AC14=\"\",AB14,INDEX(Shift_Codes,IF(MATCH(AC14,Shift_Codes,0)+1>COUNTA(Shift_Codes),1,MATCH(AC14,Shift_Codes,0)+1))))","v":""},{"$f":"IF(OR($C14=\"\",AE$7=\"\"),\"\",IF(AD14=\"\",AC14,INDEX(Shift_Codes,IF(MATCH(AD14,Shift_Codes,0)+1>COUNTA(Shift_Codes),1,MATCH(AD14,Shift_Codes,0)+1))))","v":""},{"$f":"IF(OR($C14=\"\",AF$7=\"\"),\"\",IF(AE14=\"\",AD14,INDEX(Shift_Codes,IF(MATCH(AE14,Shift_Codes,0)+1>COUNTA(Shift_Codes),1,MATCH(AE14,Shift_Codes,0)+1))))","v":""},{"$f":"IF(OR($C14=\"\",AG$7=\"\"),\"\",IF(AF14=\"\",AE14,INDEX(Shift_Codes,IF(MATCH(AF14,Shift_Codes,0)+1>COUNTA(Shift_Codes),1,MATCH(AF14,Shift_Codes,0)+1))))","v":""},{"$f":"IF(OR($C14=\"\",AH$7=\"\"),\"\",IF(AG14=\"\",AF14,INDEX(Shift_Codes,IF(MATCH(AG14,Shift_Codes,0)+1>COUNTA(Shift_Codes),1,MATCH(AG14,Shift_Codes,0)+1))))","v":""},{"$f":"IF(OR($C14=\"\",AI$7=\"\"),\"\",IF(AH14=\"\",AG14,INDEX(Shift_Codes,IF(MATCH(AH14,Shift_Codes,0)+1>COUNTA(Shift_Codes),1,MATCH(AH14,Shift_Codes,0)+1))))","v":""},null,0,0]
[null,null,null,null,{"$f":"IF(OR($C15=\"\",E$7=\"\"),\"\",IF(D15=\"\",C15,INDEX(Shift_Codes,IF(MATCH(D15,Shift_Codes,0)+1>COUNTA(Shift_Codes),1,MATCH(D15,Shift_Codes,0)+1))))","v":""},{"$f":"IF(OR($C15=\"\",F$7=\"\"),\"\",IF(E15=\"\",D15,INDEX(Shift_Codes,IF(MATCH(E15,Shift_Codes,0)+1>COUNTA(Shift_Codes),1,MATCH(E15,Shift_Codes,0)+1))))","v":""},{"$f":"IF(OR($C15=\"\",G$7=\"\"),\"\",IF(F15=\"\",E15,INDEX(Shift_Codes,IF(MATCH(F15,Shift_Codes,0)+1>COUNTA(Shift_Codes),1,MATCH(F15,Shift_Codes,0)+1))))","v":""},{"$f":"IF(OR($C15=\"\",H$7=\"\"),\"\",IF(G15=\"\",F15,INDEX(Shift_Codes,IF(MATCH(G15,Shift_Codes,0)+1>COUNTA(Shift_Codes),1,MATCH(G15,Shift_Codes,0)+1))))","v":""},{"$f":"IF(OR($C15=\"\",I$7=\"\"),\"\",IF(H15=\"\",G15,INDEX(Shift_Codes,IF(MATCH(H15,Shift_Codes,0)+1>COUNTA(Shift_Codes),1,MATCH(H15,Shift_Codes,0)+1))))","v":""},{"$f":"IF(OR($C15=\"\",J$7=\"\"),\"\",IF(I15=\"\",H15,INDEX(Shift_Codes,IF(MATCH(I15,Shift_Codes,0)+1>COUNTA(Shift_Codes),1,MATCH(I15,Shift_Codes,0)+1))))","v":""},{"$f":"IF(OR($C15=\"\",K$7=\"\"),\"\",IF(J15=\"\",I15,INDEX(Shift_Codes,IF(MATCH(J15,Shift_Codes,0)+1>COUNTA(Shift_Codes),1,MATCH(J15,Shift_Codes,0)+1))))","v":""},{"$f":"IF(OR($C15=\"\",L$7=\"\"),\"\",IF(K15=\"\",J15,INDEX(Shift_Codes,IF(MATCH(K15,Shift_Codes,0)+1>COUNTA(Shift_Codes),1,MATCH(K15,Shift_Codes,0)+1))))","v":""},{"$f":"IF(OR($C15=\"\",M$7=\"\"),\"\",IF(L15=\"\",K15,INDEX(Shift_Codes,IF(MATCH(L15,Shift_Codes,0)+1>COUNTA(Shift_Codes),1,MATCH(L15,Shift_Codes,0)+1))))","v":""},{"$f":"IF(OR($C15=\"\",N$7=\"\"),\"\",IF(M15=\"\",L15,INDEX(Shift_Codes,IF(MATCH(M15,Shift_Codes,0)+1>COUNTA(Shift_Codes),1,MATCH(M15,Shift_Codes,0)+1))))","v":""},{"$f":"IF(OR($C15=\"\",O$7=\"\"),\"\",IF(N15=\"\",M15,INDEX(Shift_Codes,IF(MATCH(N15,Shift_Codes,0)+1>COUNTA(Shift_Codes),1,MATCH(N15,Shift_Codes,0)+1))))","v":""},{"$f":"IF(OR($C15=\"\",P$7=\"\"),\"\",IF(O15=\"\",N15,INDEX(Shift_Codes,IF(MATCH(O15,Shift_Codes,0)+1>COUNTA(Shift_Codes),1,MATCH(O15,Shift_Codes,0)+1))))","v":""},{"$f":"IF(OR($C15=\"\",Q$7=\"\"),\"\",IF(P15=\"\",O15,INDEX(Shift_Codes,IF(MATCH(P15,Shift_Codes,0)+1>COUNTA(Shift_Codes),1,MATCH(P15,Shift_Codes,0)+1))))","v":""},{"$f":"IF(OR($C15=\"\",R$7=\"\"),\"\",IF(Q15=\"\",P15,INDEX(Shift_Codes,IF(MATCH(Q15,Shift_Codes,0)+1>COUNTA(Shift_Codes),1,MATCH(Q15,Shift_Codes,0)+1))))","v":""},{"$f":"IF(OR($C15=\"\",S$7=\"\"),\"\",IF(R15=\"\",Q15,INDEX(Shift_Codes,IF(MATCH(R15,Shift_Codes,0)+1>COUNTA(Shift_Codes),1,MATCH(R15,Shift_Codes,0)+1))))","v":""},{"$f":"IF(OR($C15=\"\",T$7=\"\"),\"\",IF(S15=\"\",R15,INDEX(Shift_Codes,IF(MATCH(S15,Shift_Codes,0)+1>COUNTA(Shift_Codes),1,MATCH(S15,Shift_Codes,0)+1))))","v":""},{"$f":"IF(OR($C15=\"\",U$7=\"\"),\"\",IF(T15=\"\",S15,INDEX(Shift_Codes,IF(MATCH(T15,Shift_Codes,0)+1>COUNTA(Shift_Codes),1,MATCH(T15,Shift_Codes,0)+1))))","v":""},{"$f":"IF(OR($C15=\"\",V$7=\"\"),\"\",IF(U15=\"\",T15,INDEX(Shift_Codes,IF(MATCH(U15,Shift_Codes,0)+1>COUNTA(Shift_Codes),1,MATCH(U15,Shift_Codes,0)+1))))","v":""},{"$f":"IF(OR($C15=\"\",W$7=\"\"),\"\",IF(V15=\"\",U15,INDEX(Shift_Codes,IF(MATCH(V15,Shift_Codes,0)+1>COUNTA(Shift_Codes),1,MATCH(V15,Shift_Codes,0)+1))))","v":""},{"$f":"IF(OR($C15=\"\",X$7=\"\"),\"\",IF(W15=\"\",V15,INDEX(Shift_Codes,IF(MATCH(W15,Shift_Codes,0)+1>COUNTA(Shift_Codes),1,MATCH(W15,Shift_Codes,0)+1))))","v":""},{"$f":"IF(OR($C15=\"\",Y$7=\"\"),\"\",IF(X15=\"\",W15,INDEX(Shift_Codes,IF(MATCH(X15,Shift_Codes,0)+1>COUNTA(Shift_Codes),1,MATCH(X15,Shift_Codes,0)+1))))","v":""},{"$f":"IF(OR($C15=\"\",Z$7=\"\"),\"\",IF(Y15=\"\",X15,INDEX(Shift_Codes,IF(MATCH(Y15,Shift_Codes,0)+1>COUNTA(Shift_Codes),1,MATCH(Y15,Shift_Codes,0)+1))))","v":""},{"$f":"IF(OR($C15=\"\",AA$7=\"\"),\"\",IF(Z15=\"\",Y15,INDEX(Shift_Codes,IF(MATCH(Z15,Shift_Codes,0)+1>COUNTA(Shift_Codes),1,MATCH(Z15,Shift_Codes,0)+1))))","v":""},{"$f":"IF(OR($C15=\"\",AB$7=\"\"),\"\",IF(AA15=\"\",Z15,INDEX(Shift_Codes,IF(MATCH(AA15,Shift_Codes,0)+1>COUNTA(Shift_Codes),1,MATCH(AA15,Shift_Codes,0)+1))))","v":""},{"$f":"IF(OR($C15=\"\",AC$7=\"\"),\"\",IF(AB15=\"\",AA15,INDEX(Shift_Codes,IF(MATCH(AB15,Shift_Codes,0)+1>COUNTA(Shift_Codes),1,MATCH(AB15,Shift_Codes,0)+1))))","v":""},{"$f":"IF(OR($C15=\"\",AD$7=\"\"),\"\",IF(AC15=\"\",AB15,INDEX(Shift_Codes,IF(MATCH(AC15,Shift_Codes,0)+1>COUNTA(Shift_Codes),1,MATCH(AC15,Shift_Codes,0)+1))))","v":""},{"$f":"IF(OR($C15=\"\",AE$7=\"\"),\"\",IF(AD15=\"\",AC15,INDEX(Shift_Codes,IF(MATCH(AD15,Shift_Codes,0)+1>COUNTA(Shift_Codes),1,MATCH(AD15,Shift_Codes,0)+1))))","v":""},{"$f":"IF(OR($C15=\"\",AF$7=\"\"),\"\",IF(AE15=\"\",AD15,INDEX(Shift_Codes,IF(MATCH(AE15,Shift_Codes,0)+1>COUNTA(Shift_Codes),1,MATCH(AE15,Shift_Codes,0)+1))))","v":""},{"$f":"IF(OR($C15=\"\",AG$7=\"\"),\"\",IF(AF15=\"\",AE15,INDEX(Shift_Codes,IF(MATCH(AF15,Shift_Codes,0)+1>COUNTA(Shift_Codes),1,MATCH(AF15,Shift_Codes,0)+1))))","v":""},{"$f":"IF(OR($C15=\"\",AH$7=\"\"),\"\",IF(AG15=\"\",AF15,INDEX(Shift_Codes,IF(MATCH(AG15,Shift_Codes,0)+1>COUNTA(Shift_Codes),1,MATCH(AG15,Shift_Codes,0)+1))))","v":""},{"$f":"IF(OR($C15=\"\",AI$7=\"\"),\"\",IF(AH15=\"\",AG15,INDEX(Shift_Codes,IF(MATCH(AH15,Shift_Codes,0)+1>COUNTA(Shift_Codes),1,MATCH(AH15,Shift_Codes,0)+1))))","v":""},null,0,0]
[null,null,null,null,{"$f":"IF(OR($C16=\"\",E$7=\"\"),\"\",IF(D16=\"\",C16,INDEX(Shift_Codes,IF(MATCH(D16,Shift_Codes,0)+1>COUNTA(Shift_Codes),1,MATCH(D16,Shift_Codes,0)+1))))","v":""},{"$f":"IF(OR($C16=\"\",F$7=\"\"),\"\",IF(E16=\"\",D16,INDEX(Shift_Codes,IF(MATCH(E16,Shift_Codes,0)+1>COUNTA(Shift_Codes),1,MATCH(E16,Shift_Codes,0)+1))))","v":""},{"$f":"IF(OR($C16=\"\",G$7=\"\"),\"\",IF(F16=\"\",E16,INDEX(Shift_Codes,IF(MATCH(F16,Shift_Codes,0)+1>COUNTA(Shift_Codes),1,MATCH(F16,Shift_Codes,0)+1))))","v":""},{"$f":"IF(OR($C16=\"\",H$7=\"\"),\"\",IF(G16=\"\",F16,INDEX(Shift_Codes,IF(MATCH(G16,Shift_Codes,0)+1>COUNTA(Shift_Codes),1,MATCH(G16,Shift_Codes,0)+1))))","v":""},{"$f":"IF(OR($C16=\"\",I$7=\"\"),\"\",IF(H16=\"\",G16,INDEX(Shift_Codes,IF(MATCH(H16,Shift_Codes,0)+1>COUNTA(Shift_Codes),1,MATCH(H16,Shift_Codes,0)+1))))","v":""},{"$f":"IF(OR($C16=\"\",J$7=\"\"),\"\",IF(I16=\"\",H16,INDEX(Shift_Codes,IF(MATCH(I16,Shift_Codes,0)+1>COUNTA(Shift_Codes),1,MATCH(I16,Shift_Codes,0)+1))))","v":""},{"$f":"IF(OR($C16=\"\",K$7=\"\"),\"\",IF(J16=\"\",I16,INDEX(Shift_Codes,IF(MATCH(J16,Shift_Codes,0)+1>COUNTA(Shift_Codes),1,MATCH(J16,Shift_Codes,0)+1))))","v":""},{"$f":"IF(OR($C16=\"\",L$7=\"\"),\"\",IF(K16=\"\",J16,INDEX(Shift_Codes,IF(MATCH(K16,Shift_Codes,0)+1>COUNTA(Shift_Codes),1,MATCH(K16,Shift_Codes,0)+1))))","v":""},{"$f":"IF(OR($C16=\"\",M$7=\"\"),\"\",IF(L16=\"\",K16,INDEX(Shift_Codes,IF(MATCH(L16,Shift_Codes,0)+1>COUNTA(Shift_Codes),1,MATCH(L16,Shift_Codes,0)+1))))","v":""},{"$f":"IF(OR($C16=\"\",N$7=\"\"),\"\",IF(M16=\"\",L16,INDEX(Shift_Codes,IF(MATCH(M16,Shift_Codes,0)+1>COUNTA(Shift_Codes),1,MATCH(M16,Shift_Codes,0)+1))))","v":""},{"$f":"IF(OR($C16=\"\",O$7=\"\"),\"\",IF(N16=\"\",M16,INDEX(Shift_Codes,IF(MATCH(N16,Shift_Codes,0)+1>COUNTA(Shift_Codes),1,MATCH(N16,Shift_Codes,0)+1))))","v":""},{"$f":"IF(OR($C16=\"\",P$7=\"\"),\"\",IF(O16=\"\",N16,INDEX(Shift_Codes,IF(MATCH(O16,Shift_Codes,0)+1>COUNTA(Shift_Codes),1,MATCH(O16,Shift_Codes,0)+1))))","v":""},{"$f":"IF(OR($C16=\"\",Q$7=\"\"),\"\",IF(P16=\"\",O16,INDEX(Shift_Codes,IF(MATCH(P16,Shift_Codes,0)+1>COUNTA(Shift_Codes),1,MATCH(P16,Shift_Codes,0)+1))))","v":""},{"$f":"IF(OR($C16=\"\",R$7=\"\"),\"\",IF(Q16=\"\",P16,INDEX(Shift_Codes,IF(MATCH(Q16,Shift_Codes,0)+1>COUNTA(Shift_Codes),1,MATCH(Q16,Shift_Codes,0)+1))))","v":""},{"$f":"IF(OR($C16=\"\",S$7=\"\"),\"\",IF(R16=\"\",Q16,INDEX(Shift_Codes,IF(MATCH(R16,Shift_Codes,0)+1>COUNTA(Shift_Codes),1,MATCH(R16,Shift_Codes,0)+1))))","v":""},{"$f":"IF(OR($C16=\"\",T$7=\"\"),\"\",IF(S16=\"\",R16,INDEX(Shift_Codes,IF(MATCH(S16,Shift_Codes,0)+1>COUNTA(Shift_Codes),1,MATCH(S16,Shift_Codes,0)+1))))","v":""},{"$f":"IF(OR($C16=\"\",U$7=\"\"),\"\",IF(T16=\"\",S16,INDEX(Shift_Codes,IF(MATCH(T16,Shift_Codes,0)+1>COUNTA(Shift_Codes),1,MATCH(T16,Shift_Codes,0)+1))))","v":""},{"$f":"IF(OR($C16=\"\",V$7=\"\"),\"\",IF(U16=\"\",T16,INDEX(Shift_Codes,IF(MATCH(U16,Shift_Codes,0)+1>COUNTA(Shift_Codes),1,MATCH(U16,Shift_Codes,0)+1))))","v":""},{"$f":"IF(OR($C16=\"\",W$7=\"\"),\"\",IF(V16=\"\",U16,INDEX(Shift_Codes,IF(MATCH(V16,Shift_Codes,0)+1>COUNTA(Shift_Codes),1,MATCH(V16,Shift_Codes,0)+1))))","v":""},{"$f":"IF(OR($C16=\"\",X$7=\"\"),\"\",IF(W16=\"\",V16,INDEX(Shift_Codes,IF(MATCH(W16,Shift_Codes,0)+1>COUNTA(Shift_Codes),1,MATCH(W16,Shift_Codes,0)+1))))","v":""},{"$f":"IF(OR($C16=\"\",Y$7=\"\"),\"\",IF(X16=\"\",W16,INDEX(Shift_Codes,IF(MATCH(X16,Shift_Codes,0)+1>COUNTA(Shift_Codes),1,MATCH(X16,Shift_Codes,0)+1))))","v":""},{"$f":"IF(OR($C16=\"\",Z$7=\"\"),\"\",IF(Y16=\"\",X16,INDEX(Shift_Codes,IF(MATCH(Y16,Shift_Codes,0)+1>COUNTA(Shift_Codes),1,MATCH(Y16,Shift_Codes,0)+1))))","v":""},{"$f":"IF(OR($C16=\"\",AA$7=\"\"),\"\",IF(Z16=\"\",Y16,INDEX(Shift_Codes,IF(MATCH(Z16,Shift_Codes,0)+1>COUNTA(Shift_Codes),1,MATCH(Z16,Shift_Codes,0)+1))))","v":""},{"$f":"IF(OR($C16=\"\",AB$7=\"\"),\"\",IF(AA16=\"\",Z16,INDEX(Shift_Codes,IF(MATCH(AA16,Shift_Codes,0)+1>COUNTA(Shift_Codes),1,MATCH(AA16,Shift_Codes,0)+1))))","v":""},{"$f":"IF(OR($C16=\"\",AC$7=\"\"),\"\",IF(AB16=\"\",AA16,INDEX(Shift_Codes,IF(MATCH(AB16,Shift_Codes,0)+1>COUNTA(Shift_Codes),1,MATCH(AB16,Shift_Codes,0)+1))))","v":""},{"$f":"IF(OR($C16=\"\",AD$7=\"\"),\"\",IF(AC16=\"\",AB16,INDEX(Shift_Codes,IF(MATCH(AC16,Shift_Codes,0)+1>COUNTA(Shift_Codes),1,MATCH(AC16,Shift_Codes,0)+1))))","v":""},{"$f":"IF(OR($C16=\"\",AE$7=\"\"),\"\",IF(AD16=\"\",AC16,INDEX(Shift_Codes,IF(MATCH(AD16,Shift_Codes,0)+1>COUNTA(Shift_Codes),1,MATCH(AD16,Shift_Codes,0)+1))))","v":""},{"$f":"IF(OR($C16=\"\",AF$7=\"\"),\"\",IF(AE16=\"\",AD16,INDEX(Shift_Codes,IF(MATCH(AE16,Shift_Codes,0)+1>COUNTA(Shift_Codes),1,MATCH(AE16,Shift_Codes,0)+1))))","v":""},{"$f":"IF(OR($C16=\"\",AG$7=\"\"),\"\",IF(AF16=\"\",AE16,INDEX(Shift_Codes,IF(MATCH(AF16,Shift_Codes,0)+1>COUNTA(Shift_Codes),1,MATCH(AF16,Shift_Codes,0)+1))))","v":""},{"$f":"IF(OR($C16=\"\",AH$7=\"\"),\"\",IF(AG16=\"\",AF16,INDEX(Shift_Codes,IF(MATCH(AG16,Shift_Codes,0)+1>COUNTA(Shift_Codes),1,MATCH(AG16,Shift_Codes,0)+1))))","v":""},{"$f":"IF(OR($C16=\"\",AI$7=\"\"),\"\",IF(AH16=\"\",AG16,INDEX(Shift_Codes,IF(MATCH(AH16,Shift_Codes,0)+1>COUNTA(Shift_Codes),1,MATCH(AH16,Shift_Codes,0)+1))))","v":""},null,0,0]
[null,null,null,null,{"$f":"IF(OR($C17=\"\",E$7=\"\"),\"\",IF(D17=\"\",C17,INDEX(Shift_Codes,IF(MATCH(D17,Shift_Codes,0)+1>COUNTA(Shift_Codes),1,MATCH(D17,Shift_Codes,0)+1))))","v":""},{"$f":"IF(OR($C17=\"\",F$7=\"\"),\"\",IF(E17=\"\",D17,INDEX(Shift_Codes,IF(MATCH(E17,Shift_Codes,0)+1>COUNTA(Shift_Codes),1,MATCH(E17,Shift_Codes,0)+1))))","v":""},{"$f":"IF(OR($C17=\"\",G$7=\"\"),\"\",IF(F17=\"\",E17,INDEX(Shift_Codes,IF(MATCH(F17,Shift_Codes,0)+1>COUNTA(Shift_Codes),1,MATCH(F17,Shift_Codes,0)+1))))","v":""},{"$f":"IF(OR($C17=\"\",H$7=\"\"),\"\",IF(G17=\"\",F17,INDEX(Shift_Codes,IF(MATCH(G17,Shift_Codes,0)+1>COUNTA(Shift_Codes),1,MATCH(G17,Shift_Codes,0)+1))))","v":""},{"$f":"IF(OR($C17=\"\",I$7=\"\"),\"\",IF(H17=\"\",G17,INDEX(Shift_Codes,IF(MATCH(H17,Shift_Codes,0)+1>COUNTA(Shift_Codes),1,MATCH(H17,Shift_Codes,0)+1))))","v":""},{"$f":"IF(OR($C17=\"\",J$7=\"\"),\"\",IF(I17=\"\",H17,INDEX(Shift_Codes,IF(MATCH(I17,Shift_Codes,0)+1>COUNTA(Shift_Codes),1,MATCH(I17,Shift_Codes,0)+1))))","v":""},{"$f":"IF(OR($C17=\"\",K$7=\"\"),\"\",IF(J17=\"\",I17,INDEX(Shift_Codes,IF(MATCH(J17,Shift_Codes,0)+1>COUNTA(Shift_Codes),1,MATCH(J17,Shift_Codes,0)+1))))","v":""},{"$f":"IF(OR($C17=\"\",L$7=\"\"),\"\",IF(K17=\"\",J17,INDEX(Shift_Codes,IF(MATCH(K17,Shift_Codes,0)+1>COUNTA(Shift_Codes),1,MATCH(K17,Shift_Codes,0)+1))))","v":""},{"$f":"IF(OR($C17=\"\",M$7=\"\"),\"\",IF(L17=\"\",K17,INDEX(Shift_Codes,IF(MATCH(L17,Shift_Codes,0)+1>COUNTA(Shift_Codes),1,MATCH(L17,Shift_Codes,0)+1))))","v":""},{"$f":"IF(OR($C17=\"\",N$7=\"\"),\"\",IF(M17=\"\",L17,INDEX(Shift_Codes,IF(MATCH(M17,Shift_Codes,0)+1>COUNTA(Shift_Codes),1,MATCH(M17,Shift_Codes,0)+1))))","v":""},{"$f":"IF(OR($C17=\"\",O$7=\"\"),\"\",IF(N17=\"\",M17,INDEX(Shift_Codes,IF(MATCH(N17,Shift_Codes,0)+1>COUNTA(Shift_Codes),1,MATCH(N17,Shift_Codes,0)+1))))","v":""},{"$f":"IF(OR($C17=\"\",P$7=\"\"),\"\",IF(O17=\"\",N17,INDEX(Shift_Codes,IF(MATCH(O17,Shift_Codes,0)+1>COUNTA(Shift_Codes),1,MATCH(O17,Shift_Codes,0)+1))))","v":""},{"$f":"IF(OR($C17=\"\",Q$7=\"\"),\"\",IF(P17=\"\",O17,INDEX(Shift_Codes,IF(MATCH(P17,Shift_Codes,0)+1>COUNTA(Shift_Codes),1,MATCH(P17,Shift_Codes,0)+1))))","v":""},{"$f":"IF(OR($C17=\"\",R$7=\"\"),\"\",IF(Q17=\"\",P17,INDEX(Shift_Codes,IF(MATCH(Q17,Shift_Codes,0)+1>COUNTA(Shift_Codes),1,MATCH(Q17,Shift_Codes,0)+1))))","v":""},{"$f":"IF(OR($C17=\"\",S$7=\"\"),\"\",IF(R17=\"\",Q17,INDEX(Shift_Codes,IF(MATCH(R17,Shift_Codes,0)+1>COUNTA(Shift_Codes),1,MATCH(R17,Shift_Codes,0)+1))))","v":""},{"$f":"IF(OR($C17=\"\",T$7=\"\"),\"\",IF(S17=\"\",R17,INDEX(Shift_Codes,IF(MATCH(S17,Shift_Codes,0)+1>COUNTA(Shift_Codes),1,MATCH(S17,Shift_Codes,0)+1))))","v":""},{"$f":"IF(OR($C17=\"\",U$7=\"\"),\"\",IF(T17=\"\",S17,INDEX(Shift_Codes,IF(MATCH(T17,Shift_Codes,0)+1>COUNTA(Shift_Codes),1,MATCH(T17,Shift_Codes,0)+1))))","v":""},{"$f":"IF(OR($C17=\"\",V$7=\"\"),\"\",IF(U17=\"\",T17,INDEX(Shift_Codes,IF(MATCH(U17,Shift_Codes,0)+1>COUNTA(Shift_Codes),1,MATCH(U17,Shift_Codes,0)+1))))","v":""},{"$f":"IF(OR($C17=\"\",W$7=\"\"),\"\",IF(V17=\"\",U17,INDEX(Shift_Codes,IF(MATCH(V17,Shift_Codes,0)+1>COUNTA(Shift_Codes),1,MATCH(V17,Shift_Codes,0)+1))))","v":""},{"$f":"IF(OR($C17=\"\",X$7=\"\"),\"\",IF(W17=\"\",V17,INDEX(Shift_Codes,IF(MATCH(W17,Shift_Codes,0)+1>COUNTA(Shift_Codes),1,MATCH(W17,Shift_Codes,0)+1))))","v":""},{"$f":"IF(OR($C17=\"\",Y$7=\"\"),\"\",IF(X17=\"\",W17,INDEX(Shift_Codes,IF(MATCH(X17,Shift_Codes,0)+1>COUNTA(Shift_Codes),1,MATCH(X17,Shift_Codes,0)+1))))","v":""},{"$f":"IF(OR($C17=\"\",Z$7=\"\"),\"\",IF(Y17=\"\",X17,INDEX(Shift_Codes,IF(MATCH(Y17,Shift_Codes,0)+1>COUNTA(Shift_Codes),1,MATCH(Y17,Shift_Codes,0)+1))))","v":""},{"$f":"IF(OR($C17=\"\",AA$7=\"\"),\"\",IF(Z17=\"\",Y17,INDEX(Shift_Codes,IF(MATCH(Z17,Shift_Codes,0)+1>COUNTA(Shift_Codes),1,MATCH(Z17,Shift_Codes,0)+1))))","v":""},{"$f":"IF(OR($C17=\"\",AB$7=\"\"),\"\",IF(AA17=\"\",Z17,INDEX(Shift_Codes,IF(MATCH(AA17,Shift_Codes,0)+1>COUNTA(Shift_Codes),1,MATCH(AA17,Shift_Codes,0)+1))))","v":""},{"$f":"IF(OR($C17=\"\",AC$7=\"\"),\"\",IF(AB17=\"\",AA17,INDEX(Shift_Codes,IF(MATCH(AB17,Shift_Codes,0)+1>COUNTA(Shift_Codes),1,MATCH(AB17,Shift_Codes,0)+1))))","v":""},{"$f":"IF(OR($C17=\"\",AD$7=\"\"),\"\",IF(AC17=\"\",AB17,INDEX(Shift_Codes,IF(MATCH(AC17,Shift_Codes,0)+1>COUNTA(Shift_Codes),1,MATCH(AC17,Shift_Codes,0)+1))))","v":""},{"$f":"IF(OR($C17=\"\",AE$7=\"\"),\"\",IF(AD17=\"\",AC17,INDEX(Shift_Codes,IF(MATCH(AD17,Shift_Codes,0)+1>COUNTA(Shift_Codes),1,MATCH(AD17,Shift_Codes,0)+1))))","v":""},{"$f":"IF(OR($C17=\"\",AF$7=\"\"),\"\",IF(AE17=\"\",AD17,INDEX(Shift_Codes,IF(MATCH(AE17,Shift_Codes,0)+1>COUNTA(Shift_Codes),1,MATCH(AE17,Shift_Codes,0)+1))))","v":""},{"$f":"IF(OR($C17=\"\",AG$7=\"\"),\"\",IF(AF17=\"\",AE17,INDEX(Shift_Codes,IF(MATCH(AF17,Shift_Codes,0)+1>COUNTA(Shift_Codes),1,MATCH(AF17,Shift_Codes,0)+1))))","v":""},{"$f":"IF(OR($C17=\"\",AH$7=\"\"),\"\",IF(AG17=\"\",AF17,INDEX(Shift_Codes,IF(MATCH(AG17,Shift_Codes,0)+1>COUNTA(Shift_Codes),1,MATCH(AG17,Shift_Codes,0)+1))))","v":""},{"$f":"IF(OR($C17=\"\",AI$7=\"\"),\"\",IF(AH17=\"\",AG17,INDEX(Shift_Codes,IF(MATCH(AH17,Shift_Codes,0)+1>COUNTA(Shift_Codes),1,MATCH(AH17,Shift_Codes,0)+1))))","v":""},null,0,0]
[]
[null,"Total Day Shift Employees",null,null,{"$f":"COUNTIF(E$8:E$17,\"D*\")","v":1},{"$f":"COUNTIF(F$8:F$17,\"D*\")","v":0},0,0,1,1,1,0,0,0,1,1,1,0,0,0,1,1,1,0,0,0,1,1,1,0,0,0,1,1,0]
[null,"Total Night Shift Employees",null,null,{"$f":"COUNTIF(E$8:E$17,\"N*\")","v":0},{"$f":"COUNTIF(F$8:F$17,\"N*\")","v":1},1,1,0,0,0,1,1,1,0,0,0,1,1,1,0,0,0,1,1,1,0,0,0,1,1,1,0,0,0]

{"sheet":"April 2021 (2)","index":3,"n_rows":20,"n_cols":38,"rows_kept":20,"cut":false,"hidden":false,"merged":[[19,1,19,2],[5,36,6,36],[5,37,6,37],[1,36,3,37],[1,32,2,34],[3,32,3,34],[5,1,6,1],[5,2,6,2],[18,1,18,2],[3,19,3,22],[1,22,2,27],[1,28,2,31],[3,23,3,25],[3,26,3,27],[3,28,3,30],[1,4,2,21],[3,4,3,8],[3,10,3,11],[3,12,3,14],[3,15,3,17]]}
[]
[null,"Logo",null,null,"Roster of",null,null,null,null,null,null,null,null,null,null,null,null,null,null,null,null,null,"May",null,null,null,null,null,2023,null,null,null,null,null,null,null,"Final Report"]
[]
[null,null,null,null,"Month Starting Date:",null,null,null,null,3,null,null,"Start Date:",null,null,{"$f":"IFERROR(DATEVALUE(J4&W2&AC2),\"\")","v":"2023-05-03"},null,null,null,"End Date:",null,null,null,{"$f":"IFERROR(EOMONTH(P4,0)+J4-1,\"\")","v":"2023-06-02"},null,null,null,null,"Total Days:",null,null,{"$f":"X4-P4+1","v":31}]
[]
[null,"Employee","Starting Shift",null,{"$f":"TEXT(E7,\"ddd\")","v":"Wed"},{"$f":"TEXT(F7,\"ddd\")","v":"Thu"},"Fri","Sat","Sun","Mon","Tue","Wed","Thu","Fri","Sat","Sun","Mon","Tue","Wed","Thu","Fri","Sat","Sun","Mon","Tue","Wed","Thu","Fri","Sat","Sun","Mon","Tue","Wed","Thu","Fri",null,"Total Day Shifts","Total Night Shifts"]
[null,null,null,null,{"$f":"P4","v":"2023-05-03"},{"$f":"IF(E7>=$X$4,\"\",E7+1)","v":"2023-05-04"},{"$f":"IF(F7>=$X$4,\"\",F7+1)","v":"2023-05-05"},"2023-05-06","2023-05-07","2023-05-08","2023-05-09","2023-05-10","2023-05-11","2023-05-12","2023-05-13","2023-05-14","2023-05-15","2023-05-16","2023-05-17","2023-05-18","2023-05-19","2023-05-20","2023-05-21","2023-05-22","2023-05-23","2023-05-24","2023-05-25","2023-05-26","2023-05-27","2023-05-28","2023-05-29","2023-05-30",{"$f":"IF(AF7>=$X$4,\"\",AF7+1)","v":"2023-05-31"},"2023-06-01","2023-06-02"]
[null,"Jack","D3",null,{"$f":"IF(OR($C8=\"\",E$7=\"\"),\"\",IF(D8=\"\",C8,INDEX(Shift_Codes,IF(MATCH(D8,Shift_Codes,0)+1>COUNTA(Shift_Codes),1,MATCH(D8,Shift_Codes,0)+1))))","v":"D3"},{"$f":"IF(OR($C8=\"\",F$7=\"\"),\"\",IF(E8=\"\",D8,INDEX(Shift_Codes,IF(MATCH(E8,Shift_Codes,0)+1>COUNTA(Shift_Codes),1,MATCH(E8,Shift_Codes,0)+1))))","v":"N1"},{"$f":"IF(OR($C8=\"\",G$7=\"\"),\"\",IF(F8=\"\",E8,INDEX(Shift_Codes,IF(MATCH(F8,Shift_Codes,0)+1>COUNTA(Shift_Codes),1,MATCH(F8,Shift_Codes,0)+1))))","v":"N2"},{"$f":"IF(OR($C8=\"\",H$7=\"\"),\"\",IF(G8=\"\",F8,INDEX(Shift_Codes,IF(MATCH(G8,Shift_Codes,0)+1>COUNTA(Shift_Codes),1,MATCH(G8,Shift_Codes,0)+1))))","v":"N3"},{"$f":"IF(OR($C8=\"\",I$7=\"\"),\"\",IF(H8=\"\",G8,INDEX(Shift_Codes,IF(MATCH(H8,Shift_Codes,0)+1>COUNTA(Shift_Codes),1,MATCH(H8,Shift_Codes,0)+1))))","v":"D1"},{"$f":"IF(OR($C8=\"\",J$7=\"\"),\"\",IF(I8=\"\",H8,INDEX(Shift_Codes,IF(MATCH(I8,Shift_Codes,0)+1>COUNTA(Shift_Codes),1,MATCH(I8,Shift_Codes,0)+1))))","v":"D2"},{"$f":"IF(OR($C8=\"\",K$7=\"\"),\"\",IF(J8=\"\",I8,INDEX(Shift_Codes,IF(MATCH(J8,Shift_Codes,0)+1>COUNTA(Shift_Codes),1,MATCH(J8,Shift_Codes,0)+1))))","v":"D3"},{"$f":"IF(OR($C8=\"\",L$7=\"\"),\"\",IF(K8=\"\",J8,INDEX(Shift_Codes,IF(MATCH(K8,Shift_Codes,0)+1>COUNTA(Shift_Codes),1,MATCH(K8,Shift_Codes,0)+1))))","v":"N1"},{"$f":"IF(OR($C8=\"\",M$7=\"\"),\"\",IF(L8=\"\",K8,INDEX(Shift_Codes,IF(MATCH(L8,Shift_Codes,0)+1>COUNTA(Shift_Codes),1,MATCH(L8,Shift_Codes,0)+1))))","v":"N2"},{"$f":"IF(OR($C8=\"\",N$7=\"\"),\"\",IF(M8=\"\",L8,INDEX(Shift_Codes,IF(MATCH(M8,Shift_Codes,0)+1>COUNTA(Shift_Codes),1,MATCH(M8,Shift_Codes,0)+1))))","v":"N3"},{"$f":"IF(OR($C8=\"\",O$7=\"\"),\"\",IF(N8=\"\",M8,INDEX(Shift_Codes,IF(MATCH(N8,Shift_Codes,0)+1>COUNTA(Shift_Codes),1,MATCH(N8,Shift_Codes,0)+1))))","v":"D1"},{"$f":"IF(OR($C8=\"\",P$7=\"\"),\"\",IF(O8=\"\",N8,INDEX(Shift_Codes,IF(MATCH(O8,Shift_Codes,0)+1>COUNTA(Shift_Codes),1,MATCH(O8,Shift_Codes,0)+1))))","v":"D2"},{"$f":"IF(OR($C8=\"\",Q$7=\"\"),\"\",IF(P8=\"\",O8,INDEX(Shift_Codes,IF(MATCH(P8,Shift_Codes,0)+1>COUNTA(Shift_Codes),1,MATCH(P8,Shift_Codes,0)+1))))","v":"D3"},{"$f":"IF(OR($C8=\"\",R$7=\"\"),\"\",IF(Q8=\"\",P8,INDEX(Shift_Codes,IF(MATCH(Q8,Shift_Codes,0)+1>COUNTA(Shift_Codes),1,MATCH(Q8,Shift_Codes,0)+1))))","v":"N1"},{"$f":"IF(OR($C8=\"\",S$7=\"\"),\"\",IF(R8=\"\",Q8,INDEX(Shift_Codes,IF(MATCH(R8,Shift_Codes,0)+1>COUNTA(Shift_Codes),1,MATCH(R8,Shift_Codes,0)+1))))","v":"N2"},{"$f":"IF(OR($C8=\"\",T$7=\"\"),\"\",IF(S8=\"\",R8,INDEX(Shift_Codes,IF(MATCH(S8,Shift_Codes,0)+1>COUNTA(Shift_Codes),1,MATCH(S8,Shift_Codes,0)+1))))","v":"N3"},{"$f":"IF(OR($C8=\"\",U$7=\"\"),\"\",IF(T8=\"\",S8,INDEX(Shift_Codes,IF(MATCH(T8,Shift_Codes,0)+1>COUNTA(Shift_Codes),1,MATCH(T8,Shift_Codes,0)+1))))","v":"D1"},{"$f":"IF(OR($C8=\"\",V$7=\"\"),\"\",IF(U8=\"\",T8,INDEX(Shift_Codes,IF(MATCH(U8,Shift_Codes,0)+1>COUNTA(Shift_Codes),1,MATCH(U8,Shift_Codes,0)+1))))","v":"D2"},{"$f":"IF(OR($C8=\"\",W$7=\"\"),\"\",IF(V8=\"\",U8,INDEX(Shift_Codes,IF(MATCH(V8,Shift_Codes,0)+1>COUNTA(Shift_Codes),1,MATCH(V8,Shift_Codes,0)+1))))","v":"D3"},{"$f":"IF(OR($C8=\"\",X$7=\"\"),\"\",IF(W8=\"\",V8,INDEX(Shift_Codes,IF(MATCH(W8,Shift_Codes,0)+1>COUNTA(Shift_Codes),1,MATCH(W8,Shift_Codes,0)+1))))","v":"N1"},{"$f":"IF(OR($C8=\"\",Y$7=\"\"),\"\",IF(X8=\"\",W8,INDEX(Shift_Codes,IF(MATCH(X8,Shift_Codes,0)+1>COUNTA(Shift_Codes),1,MATCH(X8,Shift_Codes,0)+1))))","v":"N2"},{"$f":"IF(OR($C8=\"\",Z$7=\"\"),\"\",IF(Y8=\"\",X8,INDEX(Shift_Codes,IF(MATCH(Y8,Shift_Codes,0)+1>COUNTA(Shift_Codes),1,MATCH(Y8,Shift_Codes,0)+1))))","v":"N3"},{"$f":"IF(OR($C8=\"\",AA$7=\"\"),\"\",IF(Z8=\"\",Y8,INDEX(Shift_Codes,IF(MATCH(Z8,Shift_Codes,0)+1>COUNTA(Shift_Codes),1,MATCH(Z8,Shift_Codes,0)+1))))","v":"D1"},{"$f":"IF(OR($C8=\"\",AB$7=\"\"),\"\",IF(AA8=\"\",Z8,INDEX(Shift_Codes,IF(MATCH(AA8,Shift_Codes,0)+1>COUNTA(Shift_Codes),1,MATCH(AA8,Shift_Codes,0)+1))))","v":"D2"},{"$f":"IF(OR($C8=\"\",AC$7=\"\"),\"\",IF(AB8=\"\",AA8,INDEX(Shift_Codes,IF(MATCH(AB8,Shift_Codes,0)+1>COUNTA(Shift_Codes),1,MATCH(AB8,Shift_Codes,0)+1))))","v":"D3"},{"$f":"IF(OR($C8=\"\",AD$7=\"\"),\"\",IF(AC8=\"\",AB8,INDEX(Shift_Codes,IF(MATCH(AC8,Shift_Codes,0)+1>COUNTA(Shift_Codes),1,MATCH(AC8,Shift_Codes,0)+1))))","v":"N1"},{"$f":"IF(OR($C8=\"\",AE$7=\"\"),\"\",IF(AD8=\"\",AC8,INDEX(Shift_Codes,IF(MATCH(AD8,Shift_Codes,0)+1>COUNTA(Shift_Codes),1,MATCH(AD8,Shift_Codes,0)+1))))","v":"N2"},{"$f":"IF(OR($C8=\"\",AF$7=\"\"),\"\",IF(AE8=\"\",AD8,INDEX(Shift_Codes,IF(MATCH(AE8,Shift_Codes,0)+1>COUNTA(Shift_Codes),1,MATCH(AE8,Shift_Codes,0)+1))))","v":"N3"},{"$f":"IF(OR($C8=\"\",AG$7=\"\"),\"\",IF(AF8=\"\",AE8,INDEX(Shift_Codes,IF(MATCH(AF8,Shift_Codes,0)+1>COUNTA(Shift_Codes),1,MATCH(AF8,Shift_Codes,0)+1))))","v":"D1"},{"$f":"IF(OR($C8=\"\",AH$7=\"\"),\"\",IF(AG8=\"\",AF8,INDEX(Shift_Codes,IF(MATCH(AG8,Shift_Codes,0)+1>COUNTA(Shift_Codes),1,MATCH(AG8,Shift_Codes,0)+1))))","v":"D2"},{"$f":"IF(OR($C8=\"\",AI$7=\"\"),\"\",IF(AH8=\"\",AG8,INDEX(Shift_Codes,IF(MATCH(AH8,Shift_Codes,0)+1>COUNTA(Shift_Codes),1,MATCH(AH8,Shift_Codes,0)+1))))","v":"D3"},null,{"$f":"COUNTIF($E8:$AI8,\"D*\")","v":16},{"$f":"COUNTIF($E8:$AI8,\"N*\")","v":15}]
[null,null,null,null,{"$f":"IF(OR($C9=\"\",E$7=\"\"),\"\",IF(D9=\"\",C9,INDEX(Shift_Codes,IF(MATCH(D9,Shift_Codes,0)+1>COUNTA(Shift_Codes),1,MATCH(D9,Shift_Codes,0)+1))))","v":""},{"$f":"IF(OR($C9=\"\",F$7=\"\"),\"\",IF(E9=\"\",D9,INDEX(Shift_Codes,IF(MATCH(E9,Shift_Codes,0)+1>COUNTA(Shift_Codes),1,MATCH(E9,Shift_Codes,0)+1))))","v":""},{"$f":"IF(OR($C9=\"\",G$7=\"\"),\"\",IF(F9=\"\",E9,INDEX(Shift_Codes,IF(MATCH(F9,Shift_Codes,0)+1>COUNTA(Shift_Codes),1,MATCH(F9,Shift_Codes,0)+1))))","v":""},{"$f":"IF(OR($C9=\"\",H$7=\"\"),\"\",IF(G9=\"\",F9,INDEX(Shift_Codes,IF(MATCH(G9,Shift_Codes,0)+1>COUNTA(Shift_Codes),1,MATCH(G9,Shift_Codes,0)+1))))","v":""},{"$f":"IF(OR($C9=\"\",I$7=\"\"),\"\",IF(H9=\"\",G9,INDEX(Shift_Codes,IF(MATCH(H9,Shift_Codes,0)+1>COUNTA(Shift_Codes),1,MATCH(H9,Shift_Codes,0)+1))))","v":""},{"$f":"IF(OR($C9=\"\",J$7=\"\"),\"\",IF(I9=\"\",H9,INDEX(Shift_Codes,IF(MATCH(I9,Shift_Codes,0)+1>COUNTA(Shift_Codes),1,MATCH(I9,Shift_Codes,0)+1))))","v":""},{"$f":"IF(OR($C9=\"\",K$7=\"\"),\"\",IF(J9=\"\",I9,INDEX(Shift_Codes,IF(MATCH(J9,Shift_Codes,0)+1>COUNTA(Shift_Codes),1,MATCH(J9,Shift_Codes,0)+1))))","v":""},{"$f":"IF(OR($C9=\"\",L$7=\"\"),\"\",IF(K9=\"\",J9,INDEX(Shift_Codes,IF(MATCH(K9,Shift_Codes,0)+1>COUNTA(Shift_Codes),1,MATCH(K9,Shift_Codes,0)+1))))","v":""},{"$f":"IF(OR($C9=\"\",M$7=\"\"),\"\",IF(L9=\"\",K9,INDEX(Shift_Codes,IF(MATCH(L9,Shift_Codes,0)+1>COUNTA(Shift_Codes),1,MATCH(L9,Shift_Codes,0)+1))))","v":""},{"$f":"IF(OR($C9=\"\",N$7=\"\"),\"\",IF(M9=\"\",L9,INDEX(Shift_Codes,IF(MATCH(M9,Shift_Codes,0)+1>COUNTA(Shift_Codes),1,MATCH(M9,Shift_Codes,0)+1))))","v":""},{"$f":"IF(OR($C9=\"\",O$7=\"\"),\"\",IF(N9=\"\",M9,INDEX(Shift_Codes,IF(MATCH(N9,Shift_Codes,0)+1>COUNTA(Shift_Codes),1,MATCH(N9,Shift_Codes,0)+1))))","v":""},{"$f":"IF(OR($C9=\"\",P$7=\"\"),\"\",IF(O9=\"\",N9,INDEX(Shift_Codes,IF(MATCH(O9,Shift_Codes,0)+1>COUNTA(Shift_Codes),1,MATCH(O9,Shift_Codes,0)+1))))","v":""},{"$f":"IF(OR($C9=\"\",Q$7=\"\"),\"\",IF(P9=\"\",O9,INDEX(Shift_Codes,IF(MATCH(P9,Shift_Codes,0)+1>COUNTA(Shift_Codes),1,MATCH(P9,Shift_Codes,0)+1))))","v":""},{"$f":"IF(OR($C9=\"\",R$7=\"\"),\"\",IF(Q9=\"\",P9,INDEX(Shift_Codes,IF(MATCH(Q9,Shift_Codes,0)+1>COUNTA(Shift_Codes),1,MATCH(Q9,Shift_Codes,0)+1))))","v":""},{"$f":"IF(OR($C9=\"\",S$7=\"\"),\"\",IF(R9=\"\",Q9,INDEX(Shift_Codes,IF(MATCH(R9,Shift_Codes,0)+1>COUNTA(Shift_Codes),1,MATCH(R9,Shift_Codes,0)+1))))","v":""},{"$f":"IF(OR($C9=\"\",T$7=\"\"),\"\",IF(S9=\"\",R9,INDEX(Shift_Codes,IF(MATCH(S9,Shift_Codes,0)+1>COUNTA(Shift_Codes),1,MATCH(S9,Shift_Codes,0)+1))))","v":""},{"$f":"IF(OR($C9=\"\",U$7=\"\"),\"\",IF(T9=\"\",S9,INDEX(Shift_Codes,IF(MATCH(T9,Shift_Codes,0)+1>COUNTA(Shift_Codes),1,MATCH(T9,Shift_Codes,0)+1))))","v":""},{"$f":"IF(OR($C9=\"\",V$7=\"\"),\"\",IF(U9=\"\",T9,INDEX(Shift_Codes,IF(MATCH(U9,Shift_Codes,0)+1>COUNTA(Shift_Codes),1,MATCH(U9,Shift_Codes,0)+1))))","v":""},{"$f":"IF(OR($C9=\"\",W$7=\"\"),\"\",IF(V9=\"\",U9,INDEX(Shift_Codes,IF(MATCH(V9,Shift_Codes,0)+1>COUNTA(Shift_Codes),1,MATCH(V9,Shift_Codes,0)+1))))","v":""},{"$f":"IF(OR($C9=\"\",X$7=\"\"),\"\",IF(W9=\"\",V9,INDEX(Shift_Codes,IF(MATCH(W9,Shift_Codes,0)+1>COUNTA(Shift_Codes),1,MATCH(W9,Shift_Codes,0)+1))))","v":""},{"$f":"IF(OR($C9=\"\",Y$7=\"\"),\"\",IF(X9=\"\",W9,INDEX(Shift_Codes,IF(MATCH(X9,Shift_Codes,0)+1>COUNTA(Shift_Codes),1,MATCH(X9,Shift_Codes,0)+1))))","v":""},{"$f":"IF(OR($C9=\"\",Z$7=\"\"),\"\",IF(Y9=\"\",X9,INDEX(Shift_Codes,IF(MATCH(Y9,Shift_Codes,0)+1>COUNTA(Shift_Codes),1,MATCH(Y9,Shift_Codes,0)+1))))","v":""},{"$f":"IF(OR($C9=\"\",AA$7=\"\"),\"\",IF(Z9=\"\",Y9,INDEX(Shift_Codes,IF(MATCH(Z9,Shift_Codes,0)+1>COUNTA(Shift_Codes),1,MATCH(Z9,Shift_Codes,0)+1))))","v":""},{"$f":"IF(OR($C9=\"\",AB$7=\"\"),\"\",IF(AA9=\"\",Z9,INDEX(Shift_Codes,IF(MATCH(AA9,Shift_Codes,0)+1>COUNTA(Shift_Codes),1,MATCH(AA9,Shift_Codes,0)+1))))","v":""},{"$f":"IF(OR($C9=\"\",AC$7=\"\"),\"\",IF(AB9=\"\",AA9,INDEX(Shift_Codes,IF(MATCH(AB9,Shift_Codes,0)+1>COUNTA(Shift_Codes),1,MATCH(AB9,Shift_Codes,0)+1))))","v":""},{"$f":"IF(OR($C9=\"\",AD$7=\"\"),\"\",IF(AC9=\"\",AB9,INDEX(Shift_Codes,IF(MATCH(AC9,Shift_Codes,0)+1>COUNTA(Shift_Codes),1,MATCH(AC9,Shift_Codes,0)+1))))","v":""},{"$f":"IF(OR($C9=\"\",AE$7=\"\"),\"\",IF(AD9=\"\",AC9,INDEX(Shift_Codes,IF(MATCH(AD9,Shift_Codes,0)+1>COUNTA(Shift_Codes),1,MATCH(AD9,Shift_Codes,0)+1))))","v":""},{"$f":"IF(OR($C9=\"\",AF$7=\"\"),\"\",IF(AE9=\"\",AD9,INDEX(Shift_Codes,IF(MATCH(AE9,Shift_Codes,0)+1>COUNTA(Shift_Codes),1,MATCH(AE9,Shift_Codes,0)+1))))","v":""},{"$f":"IF(OR($C9=\"\",AG$7=\"\"),\"\",IF(AF9=\"\",AE9,INDEX(Shift_Codes,IF(MATCH(AF9,Shift_Codes,0)+1>COUNTA(Shift_Codes),1,MATCH(AF9,Shift_Codes,0)+1))))","v":""},{"$f":"IF(OR($C9=\"\",AH$7=\"\"),\"\",IF(AG9=\"\",AF9,INDEX(Shift_Codes,IF(MATCH(AG9,Shift_Codes,0)+1>COUNTA(Shift_Codes),1,MATCH(AG9,Shift_Codes,0)+1))))","v":""},{"$f":"IF(OR($C9=\"\",AI$7=\"\"),\"\",IF(AH9=\"\",AG9,INDEX(Shift_Codes,IF(MATCH(AH9,Shift_Codes,0)+1>COUNTA(Shift_Codes),1,MATCH(AH9,Shift_Codes,0)+1))))","v":""},null,{"$f":"COUNTIF($E9:$AI9,\"D*\")","v":0},{"$f":"COUNTIF($E9:$AI9,\"N*\")","v":0}]
[null,null,null,null,{"$f":"IF(OR($C10=\"\",E$7=\"\"),\"\",IF(D10=\"\",C10,INDEX(Shift_Codes,IF(MATCH(D10,Shift_Codes,0)+1>COUNTA(Shift_Codes),1,MATCH(D10,Shift_Codes,0)+1))))","v":""},{"$f":"IF(OR($C10=\"\",F$7=\"\"),\"\",IF(E10=\"\",D10,INDEX(Shift_Codes,IF(MATCH(E10,Shift_Codes,0)+1>COUNTA(Shift_Codes),1,MATCH(E10,Shift_Codes,0)+1))))","v":""},{"$f":"IF(OR($C10=\"\",G$7=\"\"),\"\",IF(F10=\"\",E10,INDEX(Shift_Codes,IF(MATCH(F10,Shift_Codes,0)+1>COUNTA(Shift_Codes),1,MATCH(F10,Shift_Codes,0)+1))))","v":""},{"$f":"IF(OR($C10=\"\",H$7=\"\"),\"\",IF(G10=\"\",F10,INDEX(Shift_Codes,IF(MATCH(G10,Shift_Codes,0)+1>COUNTA(Shift_Codes),1,MATCH(G10,Shift_Codes,0)+1))))","v":""},{"$f":"IF(OR($C10=\"\",I$7=\"\"),\"\",IF(H10=\"\",G10,INDEX(Shift_Codes,IF(MATCH(H10,Shift_Codes,0)+1>COUNTA(Shift_Codes),1,MATCH(H10,Shift_Codes,0)+1))))","v":""},{"$f":"IF(OR($C10=\"\",J$7=\"\"),\"\",IF(I10=\"\",H10,INDEX(Shift_Codes,IF(MATCH(I10,Shift_Codes,0)+1>COUNTA(Shift_Codes),1,MATCH(I10,Shift_Codes,0)+1))))","v":""},{"$f":"IF(OR($C10=\"\",K$7=\"\"),\"\",IF(J10=\"\",I10,INDEX(Shift_Codes,IF(MATCH(J10,Shift_Codes,0)+1>COUNTA(Shift_Codes),1,MATCH(J10,Shift_Codes,0)+1))))","v":""},{"$f":"IF(OR($C10=\"\",L$7=\"\"),\"\",IF(K10=\"\",J10,INDEX(Shift_Codes,IF(MATCH(K10,Shift_Codes,0)+1>COUNTA(Shift_Codes),1,MATCH(K10,Shift_Codes,0)+1))))","v":""},{"$f":"IF(OR($C10=\"\",M$7=\"\"),\"\",IF(L10=\"\",K10,INDEX(Shift_Codes,IF(MATCH(L10,Shift_Codes,0)+1>COUNTA(Shift_Codes),1,MATCH(L10,Shift_Codes,0)+1))))","v":""},{"$f":"IF(OR($C10=\"\",N$7=\"\"),\"\",IF(M10=\"\",L10,INDEX(Shift_Codes,IF(MATCH(M10,Shift_Codes,0)+1>COUNTA(Shift_Codes),1,MATCH(M10,Shift_Codes,0)+1))))","v":""},{"$f":"IF(OR($C10=\"\",O$7=\"\"),\"\",IF(N10=\"\",M10,INDEX(Shift_Codes,IF(MATCH(N10,Shift_Codes,0)+1>COUNTA(Shift_Codes),1,MATCH(N10,Shift_Codes,0)+1))))","v":""},{"$f":"IF(OR($C10=\"\",P$7=\"\"),\"\",IF(O10=\"\",N10,INDEX(Shift_Codes,IF(MATCH(O10,Shift_Codes,0)+1>COUNTA(Shift_Codes),1,MATCH(O10,Shift_Codes,0)+1))))","v":""},{"$f":"IF(OR($C10=\"\",Q$7=\"\"),\"\",IF(P10=\"\",O10,INDEX(Shift_Codes,IF(MATCH(P10,Shift_Codes,0)+1>COUNTA(Shift_Codes),1,MATCH(P10,Shift_Codes,0)+1))))","v":""},{"$f":"IF(OR($C10=\"\",R$7=\"\"),\"\",IF(Q10=\"\",P10,INDEX(Shift_Codes,IF(MATCH(Q10,Shift_Codes,0)+1>COUNTA(Shift_Codes),1,MATCH(Q10,Shift_Codes,0)+1))))","v":""},{"$f":"IF(OR($C10=\"\",S$7=\"\"),\"\",IF(R10=\"\",Q10,INDEX(Shift_Codes,IF(MATCH(R10,Shift_Codes,0)+1>COUNTA(Shift_Codes),1,MATCH(R10,Shift_Codes,0)+1))))","v":""},{"$f":"IF(OR($C10=\"\",T$7=\"\"),\"\",IF(S10=\"\",R10,INDEX(Shift_Codes,IF(MATCH(S10,Shift_Codes,0)+1>COUNTA(Shift_Codes),1,MATCH(S10,Shift_Codes,0)+1))))","v":""},{"$f":"IF(OR($C10=\"\",U$7=\"\"),\"\",IF(T10=\"\",S10,INDEX(Shift_Codes,IF(MATCH(T10,Shift_Codes,0)+1>COUNTA(Shift_Codes),1,MATCH(T10,Shift_Codes,0)+1))))","v":""},{"$f":"IF(OR($C10=\"\",V$7=\"\"),\"\",IF(U10=\"\",T10,INDEX(Shift_Codes,IF(MATCH(U10,Shift_Codes,0)+1>COUNTA(Shift_Codes),1,MATCH(U10,Shift_Codes,0)+1))))","v":""},{"$f":"IF(OR($C10=\"\",W$7=\"\"),\"\",IF(V10=\"\",U10,INDEX(Shift_Codes,IF(MATCH(V10,Shift_Codes,0)+1>COUNTA(Shift_Codes),1,MATCH(V10,Shift_Codes,0)+1))))","v":""},{"$f":"IF(OR($C10=\"\",X$7=\"\"),\"\",IF(W10=\"\",V10,INDEX(Shift_Codes,IF(MATCH(W10,Shift_Codes,0)+1>COUNTA(Shift_Codes),1,MATCH(W10,Shift_Codes,0)+1))))","v":""},{"$f":"IF(OR($C10=\"\",Y$7=\"\"),\"\",IF(X10=\"\",W10,INDEX(Shift_Codes,IF(MATCH(X10,Shift_Codes,0)+1>COUNTA(Shift_Codes),1,MATCH(X10,Shift_Codes,0)+1))))","v":""},{"$f":"IF(OR($C10=\"\",Z$7=\"\"),\"\",IF(Y10=\"\",X10,INDEX(Shift_Codes,IF(MATCH(Y10,Shift_Codes,0)+1>COUNTA(Shift_Codes),1,MATCH(Y10,Shift_Codes,0)+1))))","v":""},{"$f":"IF(OR($C10=\"\",AA$7=\"\"),\"\",IF(Z10=\"\",Y10,INDEX(Shift_Codes,IF(MATCH(Z10,Shift_Codes,0)+1>COUNTA(Shift_Codes),1,MATCH(Z10,Shift_Codes,0)+1))))","v":""},{"$f":"IF(OR($C10=\"\",AB$7=\"\"),\"\",IF(AA10=\"\",Z10,INDEX(Shift_Codes,IF(MATCH(AA10,Shift_Codes,0)+1>COUNTA(Shift_Codes),1,MATCH(AA10,Shift_Codes,0)+1))))","v":""},{"$f":"IF(OR($C10=\"\",AC$7=\"\"),\"\",IF(AB10=\"\",AA10,INDEX(Shift_Codes,IF(MATCH(AB10,Shift_Codes,0)+1>COUNTA(Shift_Codes),1,MATCH(AB10,Shift_Codes,0)+1))))","v":""},{"$f":"IF(OR($C10=\"\",AD$7=\"\"),\"\",IF(AC10=\"\",AB10,INDEX(Shift_Codes,IF(MATCH(AC10,Shift_Codes,0)+1>COUNTA(Shift_Codes),1,MATCH(AC10,Shift_Codes,0)+1))))","v":""},{"$f":"IF(OR($C10=\"\",AE$7=\"\"),\"\",IF(AD10=\"\",AC10,INDEX(Shift_Codes,IF(MATCH(AD10,Shift_Codes,0)+1>COUNTA(Shift_Codes),1,MATCH(AD10,Shift_Codes,0)+1))))","v":""},{"$f":"IF(OR($C10=\"\",AF$7=\"\"),\"\",IF(AE10=\"\",AD10,INDEX(Shift_Codes,IF(MATCH(AE10,Shift_Codes,0)+1>COUNTA(Shift_Codes),1,MATCH(AE10,Shift_Codes,0)+1))))","v":""},{"$f":"IF(OR($C10=\"\",AG$7=\"\"),\"\",IF(AF10=\"\",AE10,INDEX(Shift_Codes,IF(MATCH(AF10,Shift_Codes,0)+1>COUNTA(Shift_Codes),1,MATCH(AF10,Shift_Codes,0)+1))))","v":""},{"$f":"IF(OR($C10=\"\",AH$7=\"\"),\"\",IF(AG10=\"\",AF10,INDEX(Shift_Codes,IF(MATCH(AG10,Shift_Codes,0)+1>COUNTA(Shift_Codes),1,MATCH(AG10,Shift_Codes,0)+1))))","v":""},{"$f":"IF(OR($C10=\"\",AI$7=\"\"),\"\",IF(AH10=\"\",AG10,INDEX(Shift_Codes,IF(MATCH(AH10,Shift_Codes,0)+1>COUNTA(Shift_Codes),1,MATCH(AH10,Shift_Codes,0)+1))))","v":""},null,0,0]
[null,null,null,null,{"$f":"IF(OR($C11=\"\",E$7=\"\"),\"\",IF(D11=\"\",C11,INDEX(Shift_Codes,IF(MATCH(D11,Shift_Codes,0)+1>COUNTA(Shift_Codes),1,MATCH(D11,Shift_Codes,0)+1))))","v":""},{"$f":"IF(OR($C11=\"\",F$7=\"\"),\"\",IF(E11=\"\",D11,INDEX(Shift_Codes,IF(MATCH(E11,Shift_Codes,0)+1>COUNTA(Shift_Codes),1,MATCH(E11,Shift_Codes,0)+1))))","v":""},{"$f":"IF(OR($C11=\"\",G$7=\"\"),\"\",IF(F11=\"\",E11,INDEX(Shift_Codes,IF(MATCH(F11,Shift_Codes,0)+1>COUNTA(Shift_Codes),1,MATCH(F11,Shift_Codes,0)+1))))","v":""},{"$f":"IF(OR($C11=\"\",H$7=\"\"),\"\",IF(G11=\"\",F11,INDEX(Shift_Codes,IF(MATCH(G11,Shift_Codes,0)+1>COUNTA(Shift_Codes),1,MATCH(G11,Shift_Codes,0)+1))))","v":""},{"$f":"IF(OR($C11=\"\",I$7=\"\"),\"\",IF(H11=\"\",G11,INDEX(Shift_Codes,IF(MATCH(H11,Shift_Codes,0)+1>COUNTA(Shift_Codes),1,MATCH(H11,Shift_Codes,0)+1))))","v":""},{"$f":"IF(OR($C11=\"\",J$7=\"\"),\"\",IF(I11=\"\",H11,INDEX(Shift_Codes,IF(MATCH(I11,Shift_Codes,0)+1>COUNTA(Shift_Codes),1,MATCH(I11,Shift_Codes,0)+1))))","v":""},{"$f":"IF(OR($C11=\"\",K$7=\"\"),\"\",IF(J11=\"\",I11,INDEX(Shift_Codes,IF(MATCH(J11,Shift_Codes,0)+1>COUNTA(Shift_Codes),1,MATCH(J11,Shift_Codes,0)+1))))","v":""},{"$f":"IF(OR($C11=\"\",L$7=\"\"),\"\",IF(K11=\"\",J11,INDEX(Shift_Codes,IF(MATCH(K11,Shift_Codes,0)+1>COUNTA(Shift_Codes),1,MATCH(K11,Shift_Codes,0)+1))))","v":""},{"$f":"IF(OR($C11=\"\",M$7=\"\"),\"\",IF(L11=\"\",K11,INDEX(Shift_Codes,IF(MATCH(L11,Shift_Codes,0)+1>COUNTA(Shift_Codes),1,MATCH(L11,Shift_Codes,0)+1))))","v":""},{"$f":"IF(OR($C11=\"\",N$7=\"\"),\"\",IF(M11=\"\",L11,INDEX(Shift_Codes,IF(MATCH(M11,Shift_Codes,0)+1>COUNTA(Shift_Codes),1,MATCH(M11,Shift_Codes,0)+1))))","v":""},{"$f":"IF(OR($C11=\"\",O$7=\"\"),\"\",IF(N11=\"\",M11,INDEX(Shift_Codes,IF(MATCH(N11,Shift_Codes,0)+1>COUNTA(Shift_Codes),1,MATCH(N11,Shift_Codes,0)+1))))","v":""},{"$f":"IF(OR($C11=\"\",P$7=\"\"),\"\",IF(O11=\"\",N11,INDEX(Shift_Codes,IF(MATCH(O11,Shift_Codes,0)+1>COUNTA(Shift_Codes),1,MATCH(O11,Shift_Codes,0)+1))))","v":""},{"$f":"IF(OR($C11=\"\",Q$7=\"\"),\"\",IF(P11=\"\",O11,INDEX(Shift_Codes,IF(MATCH(P11,Shift_Codes,0)+1>COUNTA(Shift_Codes),1,MATCH(P11,Shift_Codes,0)+1))))","v":""},{"$f":"IF(OR($C11=\"\",R$7=\"\"),\"\",IF(Q11=\"\",P11,INDEX(Shift_Codes,IF(MATCH(Q11,Shift_Codes,0)+1>COUNTA(Shift_Codes),1,MATCH(Q11,Shift_Codes,0)+1))))","v":""},{"$f":"IF(OR($C11=\"\",S$7=\"\"),\"\",IF(R11=\"\",Q11,INDEX(Shift_Codes,IF(MATCH(R11,Shift_Codes,0)+1>COUNTA(Shift_Codes),1,MATCH(R11,Shift_Codes,0)+1))))","v":""},{"$f":"IF(OR($C11=\"\",T$7=\"\"),\"\",IF(S11=\"\",R11,INDEX(Shift_Codes,IF(MATCH(S11,Shift_Codes,0)+1>COUNTA(Shift_Codes),1,MATCH(S11,Shift_Codes,0)+1))))","v":""},{"$f":"IF(OR($C11=\"\",U$7=\"\"),\"\",IF(T11=\"\",S11,INDEX(Shift_Codes,IF(MATCH(T11,Shift_Codes,0)+1>COUNTA(Shift_Codes),1,MATCH(T11,Shift_Codes,0)+1))))","v":""},{"$f":"IF(OR($C11=\"\",V$7=\"\"),\"\",IF(U11=\"\",T11,INDEX(Shift_Codes,IF(MATCH(U11,Shift_Codes,0)+1>COUNTA(Shift_Codes),1,MATCH(U11,Shift_Codes,0)+1))))","v":""},{"$f":"IF(OR($C11=\"\",W$7=\"\"),\"\",IF(V11=\"\",U11,INDEX(Shift_Codes,IF(MATCH(V11,Shift_Codes,0)+1>COUNTA(Shift_Codes),1,MATCH(V11,Shift_Codes,0)+1))))","v":""},{"$f":"IF(OR($C11=\"\",X$7=\"\"),\"\",IF(W11=\"\",V11,INDEX(Shift_Codes,IF(MATCH(W11,Shift_Codes,0)+1>COUNTA(Shift_Codes),1,MATCH(W11,Shift_Codes,0)+1))))","v":""},{"$f":"IF(OR($C11=\"\",Y$7=\"\"),\"\",IF(X11=\"\",W11,INDEX(Shift_Codes,IF(MATCH(X11,Shift_Codes,0)+1>COUNTA(Shift_Codes),1,MATCH(X11,Shift_Codes,0)+1))))","v":""},{"$f":"IF(OR($C11=\"\",Z$7=\"\"),\"\",IF(Y11=\"\",X11,INDEX(Shift_Codes,IF(MATCH(Y11,Shift_Codes,0)+1>COUNTA(Shift_Codes),1,MATCH(Y11,Shift_Codes,0)+1))))","v":""},{"$f":"IF(OR($C11=\"\",AA$7=\"\"),\"\",IF(Z11=\"\",Y11,INDEX(Shift_Codes,IF(MATCH(Z11,Shift_Codes,0)+1>COUNTA(Shift_Codes),1,MATCH(Z11,Shift_Codes,0)+1))))","v":""},{"$f":"IF(OR($C11=\"\",AB$7=\"\"),\"\",IF(AA11=\"\",Z11,INDEX(Shift_Codes,IF(MATCH(AA11,Shift_Codes,0)+1>COUNTA(Shift_Codes),1,MATCH(AA11,Shift_Codes,0)+1))))","v":""},{"$f":"IF(OR($C11=\"\",AC$7=\"\"),\"\",IF(AB11=\"\",AA11,INDEX(Shift_Codes,IF(MATCH(AB11,Shift_Codes,0)+1>COUNTA(Shift_Codes),1,MATCH(AB11,Shift_Codes,0)+1))))","v":""},{"$f":"IF(OR($C11=\"\",AD$7=\"\"),\"\",IF(AC11=\"\",AB11,INDEX(Shift_Codes,IF(MATCH(AC11,Shift_Codes,0)+1>COUNTA(Shift_Codes),1,MATCH(AC11,Shift_Codes,0)+1))))","v":""},{"$f":"IF(OR($C11=\"\",AE$7=\"\"),\"\",IF(AD11=\"\",AC11,INDEX(Shift_Codes,IF(MATCH(AD11,Shift_Codes,0)+1>COUNTA(Shift_Codes),1,MATCH(AD11,Shift_Codes,0)+1))))","v":""},{"$f":"IF(OR($C11=\"\",AF$7=\"\"),\"\",IF(AE11=\"\",AD11,INDEX(Shift_Codes,IF(MATCH(AE11,Shift_Codes,0)+1>COUNTA(Shift_Codes),1,MATCH(AE11,Shift_Codes,0)+1))))","v":""},{"$f":"IF(OR($C11=\"\",AG$7=\"\"),\"\",IF(AF11=\"\",AE11,INDEX(Shift_Codes,IF(MATCH(AF11,Shift_Codes,0)+1>COUNTA(Shift_Codes),1,MATCH(AF11,Shift_Codes,0)+1))))","v":""},{"$f":"IF(OR($C11=\"\",AH$7=\"\"),\"\",IF(AG11=\"\",AF11,INDEX(Shift_Codes,IF(MATCH(AG11,Shift_Codes,0)+1>COUNTA(Shift_Codes),1,MATCH(AG11,Shift_Codes,0)+1))))","v":""},{"$f":"IF(OR($C11=\"\",AI$7=\"\"),\"\",IF(AH11=\"\",AG11,INDEX(Shift_Codes,IF(MATCH(AH11,Shift_Codes,0)+1>COUNTA(Shift_Codes),1,MATCH(AH11,Shift_Codes,0)+1))))","v":""},null,0,0]
[null,null,null,null,{"$f":"IF(OR($C12=\"\",E$7=\"\"),\"\",IF(D12=\"\",C12,INDEX(Shift_Codes,IF(MATCH(D12,Shift_Codes,0)+1>COUNTA(Shift_Codes),1,MATCH(D12,Shift_Codes,0)+1))))","v":""},{"$f":"IF(OR($C12=\"\",F$7=\"\"),\"\",IF(E12=\"\",D12,INDEX(Shift_Codes,IF(MATCH(E12,Shift_Codes,0)+1>COUNTA(Shift_Codes),1,MATCH(E12,Shift_Codes,0)+1))))","v":""},{"$f":"IF(OR($C12=\"\",G$7=\"\"),\"\",IF(F12=\"\",E12,INDEX(Shift_Codes,IF(MATCH(F12,Shift_Codes,0)+1>COUNTA(Shift_Codes),1,MATCH(F12,Shift_Codes,0)+1))))","v":""},{"$f":"IF(OR($C12=\"\",H$7=\"\"),\"\",IF(G12=\"\",F12,INDEX(Shift_Codes,IF(MATCH(G12,Shift_Codes,0)+1>COUNTA(Shift_Codes),1,MATCH(G12,Shift_Codes,0)+1))))","v":""},{"$f":"IF(OR($C12=\"\",I$7=\"\"),\"\",IF(H12=\"\",G12,INDEX(Shift_Codes,IF(MATCH(H12,Shift_Codes,0)+1>COUNTA(Shift_Codes),1,MATCH(H12,Shift_Codes,0)+1))))","v":""},{"$f":"IF(OR($C12=\"\",J$7=\"\"),\"\",IF(I12=\"\",H12,INDEX(Shift_Codes,IF(MATCH(I12,Shift_Codes,0)+1>COUNTA(Shift_Codes),1,MATCH(I12,Shift_Codes,0)+1))))","v":""},{"$f":"IF(OR($C12=\"\",K$7=\"\"),\"\",IF(J12=\"\",I12,INDEX(Shift_Codes,IF(MATCH(J12,Shift_Codes,0)+1>COUNTA(Shift_Codes),1,MATCH(J12,Shift_Codes,0)+1))))","v":""},{"$f":"IF(OR($C12=\"\",L$7=\"\"),\"\",IF(K12=\"\",J12,INDEX(Shift_Codes,IF(MATCH(K12,Shift_Codes,0)+1>COUNTA(Shift_Codes),1,MATCH(K12,Shift_Codes,0)+1))))","v":""},{"$f":"IF(OR($C12=\"\",M$7=\"\"),\"\",IF(L12=\"\",K12,INDEX(Shift_Codes,IF(MATCH(L12,Shift_Codes,0)+1>COUNTA(Shift_Codes),1,MATCH(L12,Shift_Codes,0)+1))))","v":""},{"$f":"IF(OR($C12=\"\",N$7=\"\"),\"\",IF(M12=\"\",L12,INDEX(Shift_Codes,IF(MATCH(M12,Shift_Codes,0)+1>COUNTA(Shift_Codes),1,MATCH(M12,Shift_Codes,0)+1))))","v":""},{"$f":"IF(OR($C12=\"\",O$7=\"\"),\"\",IF(N12=\"\",M12,INDEX(Shift_Codes,IF(MATCH(N12,Shift_Codes,0)+1>COUNTA(Shift_Codes),1,MATCH(N12,Shift_Codes,0)+1))))","v":""},{"$f":"IF(OR($C12=\"\",P$7=\"\"),\"\",IF(O12=\"\",N12,INDEX(Shift_Codes,IF(MATCH(O12,Shift_Codes,0)+1>COUNTA(Shift_Codes),1,MATCH(O12,Shift_Codes,0)+1))))","v":""},{"$f":"IF(OR($C12=\"\",Q$7=\"\"),\"\",IF(P12=\"\",O12,INDEX(Shift_Codes,IF(MATCH(P12,Shift_Codes,0)+1>COUNTA(Shift_Codes),1,MATCH(P12,Shift_Codes,0)+1))))","v":""},{"$f":"IF(OR($C12=\"\",R$7=\"\"),\"\",IF(Q12=\"\",P12,INDEX(Shift_Codes,IF(MATCH(Q12,Shift_Codes,0)+1>COUNTA(Shift_Codes),1,MATCH(Q12,Shift_Codes,0)+1))))","v":""},{"$f":"IF(OR($C12=\"\",S$7=\"\"),\"\",IF(R12=\"\",Q12,INDEX(Shift_Codes,IF(MATCH(R12,Shift_Codes,0)+1>COUNTA(Shift_Codes),1,MATCH(R12,Shift_Codes,0)+1))))","v":""},{"$f":"IF(OR($C12=\"\",T$7=\"\"),\"\",IF(S12=\"\",R12,INDEX(Shift_Codes,IF(MATCH(S12,Shift_Codes,0)+1>COUNTA(Shift_Codes),1,MATCH(S12,Shift_Codes,0)+1))))","v":""},{"$f":"IF(OR($C12=\"\",U$7=\"\"),\"\",IF(T12=\"\",S12,INDEX(Shift_Codes,IF(MATCH(T12,Shift_Codes,0)+1>COUNTA(Shift_Codes),1,MATCH(T12,Shift_Codes,0)+1))))","v":""},{"$f":"IF(OR($C12=\"\",V$7=\"\"),\"\",IF(U12=\"\",T12,INDEX(Shift_Codes,IF(MATCH(U12,Shift_Codes,0)+1>COUNTA(Shift_Codes),1,MATCH(U12,Shift_Codes,0)+1))))","v":""},{"$f":"IF(OR($C12=\"\",W$7=\"\"),\"\",IF(V12=\"\",U12,INDEX(Shift_Codes,IF(MATCH(V12,Shift_Codes,0)+1>COUNTA(Shift_Codes),1,MATCH(V12,Shift_Codes,0)+1))))","v":""},{"$f":"IF(OR($C12=\"\",X$7=\"\"),\"\",IF(W12=\"\",V12,INDEX(Shift_Codes,IF(MATCH(W12,Shift_Codes,0)+1>COUNTA(Shift_Codes),1,MATCH(W12,Shift_Codes,0)+1))))","v":""},{"$f":"IF(OR($C12=\"\",Y$7=\"\"),\"\",IF(X12=\"\",W12,INDEX(Shift_Codes,IF(MATCH(X12,Shift_Codes,0)+1>COUNTA(Shift_Codes),1,MATCH(X12,Shift_Codes,0)+1))))","v":""},{"$f":"IF(OR($C12=\"\",Z$7=\"\"),\"\",IF(Y12=\"\",X12,INDEX(Shift_Codes,IF(MATCH(Y12,Shift_Codes,0)+1>COUNTA(Shift_Codes),1,MATCH(Y12,Shift_Codes,0)+1))))","v":""},{"$f":"IF(OR($C12=\"\",AA$7=\"\"),\"\",IF(Z12=\"\",Y12,INDEX(Shift_Codes,IF(MATCH(Z12,Shift_Codes,0)+1>COUNTA(Shift_Codes),1,MATCH(Z12,Shift_Codes,0)+1))))","v":""},{"$f":"IF(OR($C12=\"\",AB$7=\"\"),\"\",IF(AA12=\"\",Z12,INDEX(Shift_Codes,IF(MATCH(AA12,Shift_Codes,0)+1>COUNTA(Shift_Codes),1,MATCH(AA12,Shift_Codes,0)+1))))","v":""},{"$f":"IF(OR($C12=\"\",AC$7=\"\"),\"\",IF(AB12=\"\",AA12,INDEX(Shift_Codes,IF(MATCH(AB12,Shift_Codes,0)+1>COUNTA(Shift_Codes),1,MATCH(AB12,Shift_Codes,0)+1))))","v":""},{"$f":"IF(OR($C12=\"\",AD$7=\"\"),\"\",IF(AC12=\"\",AB12,INDEX(Shift_Codes,IF(MATCH(AC12,Shift_Codes,0)+1>COUNTA(Shift_Codes),1,MATCH(AC12,Shift_Codes,0)+1))))","v":""},{"$f":"IF(OR($C12=\"\",AE$7=\"\"),\"\",IF(AD12=\"\",AC12,INDEX(Shift_Codes,IF(MATCH(AD12,Shift_Codes,0)+1>COUNTA(Shift_Codes),1,MATCH(AD12,Shift_Codes,0)+1))))","v":""},{"$f":"IF(OR($C12=\"\",AF$7=\"\"),\"\",IF(AE12=\"\",AD12,INDEX(Shift_Codes,IF(MATCH(AE12,Shift_Codes,0)+1>COUNTA(Shift_Codes),1,MATCH(AE12,Shift_Codes,0)+1))))","v":""},{"$f":"IF(OR($C12=\"\",AG$7=\"\"),\"\",IF(AF12=\"\",AE12,INDEX(Shift_Codes,IF(MATCH(AF12,Shift_Codes,0)+1>COUNTA(Shift_Codes),1,MATCH(AF12,Shift_Codes,0)+1))))","v":""},{"$f":"IF(OR($C12=\"\",AH$7=\"\"),\"\",IF(AG12=\"\",AF12,INDEX(Shift_Codes,IF(MATCH(AG12,Shift_Codes,0)+1>COUNTA(Shift_Codes),1,MATCH(AG12,Shift_Codes,0)+1))))","v":""},{"$f":"IF(OR($C12=\"\",AI$7=\"\"),\"\",IF(AH12=\"\",AG12,INDEX(Shift_Codes,IF(MATCH(AH12,Shift_Codes,0)+1>COUNTA(Shift_Codes),1,MATCH(AH12,Shift_Codes,0)+1))))","v":""},null,0,0]
[null,null,null,null,{"$f":"IF(OR($C13=\"\",E$7=\"\"),\"\",IF(D13=\"\",C13,INDEX(Shift_Codes,IF(MATCH(D13,Shift_Codes,0)+1>COUNTA(Shift_Codes),1,MATCH(D13,Shift_Codes,0)+1))))","v":""},{"$f":"IF(OR($C13=\"\",F$7=\"\"),\"\",IF(E13=\"\",D13,INDEX(Shift_Codes,IF(MATCH(E13,Shift_Codes,0)+1>COUNTA(Shift_Codes),1,MATCH(E13,Shift_Codes,0)+1))))","v":""},{"$f":"IF(OR($C13=\"\",G$7=\"\"),\"\",IF(F13=\"\",E13,INDEX(Shift_Codes,IF(MATCH(F13,Shift_Codes,0)+1>COUNTA(Shift_Codes),1,MATCH(F13,Shift_Codes,0)+1))))","v":""},{"$f":"IF(OR($C13=\"\",H$7=\"\"),\"\",IF(G13=\"\",F13,INDEX(Shift_Codes,IF(MATCH(G13,Shift_Codes,0)+1>COUNTA(Shift_Codes),1,MATCH(G13,Shift_Codes,0)+1))))","v":""},{"$f":"IF(OR($C13=\"\",I$7=\"\"),\"\",IF(H13=\"\",G13,INDEX(Shift_Codes,IF(MATCH(H13,Shift_Codes,0)+1>COUNTA(Shift_Codes),1,MATCH(H13,Shift_Codes,0)+1))))","v":""},{"$f":"IF(OR($C13=\"\",J$7=\"\"),\"\",IF(I13=\"\",H13,INDEX(Shift_Codes,IF(MATCH(I13,Shift_Codes,0)+1>COUNTA(Shift_Codes),1,MATCH(I13,Shift_Codes,0)+1))))","v":""},{"$f":"IF(OR($C13=\"\",K$7=\"\"),\"\",IF(J13=\"\",I13,INDEX(Shift_Codes,IF(MATCH(J13,Shift_Codes,0)+1>COUNTA(Shift_Codes),1,MATCH(J13,Shift_Codes,0)+1))))","v":""},{"$f":"IF(OR($C13=\"\",L$7=\"\"),\"\",IF(K13=\"\",J13,INDEX(Shift_Codes,IF(MATCH(K13,Shift_Codes,0)+1>COUNTA(Shift_Codes),1,MATCH(K13,Shift_Codes,0)+1))))","v":""},{"$f":"IF(OR($C13=\"\",M$7=\"\"),\"\",IF(L13=\"\",K13,INDEX(Shift_Codes,IF(MATCH(L13,Shift_Codes,0)+1>COUNTA(Shift_Codes),1,MATCH(L13,Shift_Codes,0)+1))))","v":""},{"$f":"IF(OR($C13=\"\",N$7=\"\"),\"\",IF(M13=\"\",L13,INDEX(Shift_Codes,IF(MATCH(M13,Shift_Codes,0)+1>COUNTA(Shift_Codes),1,MATCH(M13,Shift_Codes,0)+1))))","v":""},{"$f":"IF(OR($C13=\"\",O$7=\"\"),\"\",IF(N13=\"\",M13,INDEX(Shift_Codes,IF(MATCH(N13,Shift_Codes,0)+1>COUNTA(Shift_Codes),1,MATCH(N13,Shift_Codes,0)+1))))","v":""},{"$f":"IF(OR($C13=\"\",P$7=\"\"),\"\",IF(O13=\"\",N13,INDEX(Shift_Codes,IF(MATCH(O13,Shift_Codes,0)+1>COUNTA(Shift_Codes),1,MATCH(O13,Shift_Codes,0)+1))))","v":""},{"$f":"IF(OR($C13=\"\",Q$7=\"\"),\"\",IF(P13=\"\",O13,INDEX(Shift_Codes,IF(MATCH(P13,Shift_Codes,0)+1>COUNTA(Shift_Codes),1,MATCH(P13,Shift_Codes,0)+1))))","v":""},{"$f":"IF(OR($C13=\"\",R$7=\"\"),\"\",IF(Q13=\"\",P13,INDEX(Shift_Codes,IF(MATCH(Q13,Shift_Codes,0)+1>COUNTA(Shift_Codes),1,MATCH(Q13,Shift_Codes,0)+1))))","v":""},{"$f":"IF(OR($C13=\"\",S$7=\"\"),\"\",IF(R13=\"\",Q13,INDEX(Shift_Codes,IF(MATCH(R13,Shift_Codes,0)+1>COUNTA(Shift_Codes),1,MATCH(R13,Shift_Codes,0)+1))))","v":""},{"$f":"IF(OR($C13=\"\",T$7=\"\"),\"\",IF(S13=\"\",R13,INDEX(Shift_Codes,IF(MATCH(S13,Shift_Codes,0)+1>COUNTA(Shift_Codes),1,MATCH(S13,Shift_Codes,0)+1))))","v":""},{"$f":"IF(OR($C13=\"\",U$7=\"\"),\"\",IF(T13=\"\",S13,INDEX(Shift_Codes,IF(MATCH(T13,Shift_Codes,0)+1>COUNTA(Shift_Codes),1,MATCH(T13,Shift_Codes,0)+1))))","v":""},{"$f":"IF(OR($C13=\"\",V$7=\"\"),\"\",IF(U13=\"\",T13,INDEX(Shift_Codes,IF(MATCH(U13,Shift_Codes,0)+1>COUNTA(Shift_Codes),1,MATCH(U13,Shift_Codes,0)+1))))","v":""},{"$f":"IF(OR($C13=\"\",W$7=\"\"),\"\",IF(V13=\"\",U13,INDEX(Shift_Codes,IF(MATCH(V13,Shift_Codes,0)+1>COUNTA(Shift_Codes),1,MATCH(V13,Shift_Codes,0)+1))))","v":""},{"$f":"IF(OR($C13=\"\",X$7=\"\"),\"\",IF(W13=\"\",V13,INDEX(Shift_Codes,IF(MATCH(W13,Shift_Codes,0)+1>COUNTA(Shift_Codes),1,MATCH(W13,Shift_Codes,0)+1))))","v":""},{"$f":"IF(OR($C13=\"\",Y$7=\"\"),\"\",IF(X13=\"\",W13,INDEX(Shift_Codes,IF(MATCH(X13,Shift_Codes,0)+1>COUNTA(Shift_Codes),1,MATCH(X13,Shift_Codes,0)+1))))","v":""},{"$f":"IF(OR($C13=\"\",Z$7=\"\"),\"\",IF(Y13=\"\",X13,INDEX(Shift_Codes,IF(MATCH(Y13,Shift_Codes,0)+1>COUNTA(Shift_Codes),1,MATCH(Y13,Shift_Codes,0)+1))))","v":""},{"$f":"IF(OR($C13=\"\",AA$7=\"\"),\"\",IF(Z13=\"\",Y13,INDEX(Shift_Codes,IF(MATCH(Z13,Shift_Codes,0)+1>COUNTA(Shift_Codes),1,MATCH(Z13,Shift_Codes,0)+1))))","v":""},{"$f":"IF(OR($C13=\"\",AB$7=\"\"),\"\",IF(AA13=\"\",Z13,INDEX(Shift_Codes,IF(MATCH(AA13,Shift_Codes,0)+1>COUNTA(Shift_Codes),1,MATCH(AA13,Shift_Codes,0)+1))))","v":""},{"$f":"IF(OR($C13=\"\",AC$7=\"\"),\"\",IF(AB13=\"\",AA13,INDEX(Shift_Codes,IF(MATCH(AB13,Shift_Codes,0)+1>COUNTA(Shift_Codes),1,MATCH(AB13,Shift_Codes,0)+1))))","v":""},{"$f":"IF(OR($C13=\"\",AD$7=\"\"),\"\",IF(AC13=\"\",AB13,INDEX(Shift_Codes,IF(MATCH(AC13,Shift_Codes,0)+1>COUNTA(Shift_Codes),1,MATCH(AC13,Shift_Codes,0)+1))))","v":""},{"$f":"IF(OR($C13=\"\",AE$7=\"\"),\"\",IF(AD13=\"\",AC13,INDEX(Shift_Codes,IF(MATCH(AD13,Shift_Codes,0)+1>COUNTA(Shift_Codes),1,MATCH(AD13,Shift_Codes,0)+1))))","v":""},{"$f":"IF(OR($C13=\"\",AF$7=\"\"),\"\",IF(AE13=\"\",AD13,INDEX(Shift_Codes,IF(MATCH(AE13,Shift_Codes,0)+1>COUNTA(Shift_Codes),1,MATCH(AE13,Shift_Codes,0)+1))))","v":""},{"$f":"IF(OR($C13=\"\",AG$7=\"\"),\"\",IF(AF13=\"\",AE13,INDEX(Shift_Codes,IF(MATCH(AF13,Shift_Codes,0)+1>COUNTA(Shift_Codes),1,MATCH(AF13,Shift_Codes,0)+1))))","v":""},{"$f":"IF(OR($C13=\"\",AH$7=\"\"),\"\",IF(AG13=\"\",AF13,INDEX(Shift_Codes,IF(MATCH(AG13,Shift_Codes,0)+1>COUNTA(Shift_Codes),1,MATCH(AG13,Shift_Codes,0)+1))))","v":""},{"$f":"IF(OR($C13=\"\",AI$7=\"\"),\"\",IF(AH13=\"\",AG13,INDEX(Shift_Codes,IF(MATCH(AH13,Shift_Codes,0)+1>COUNTA(Shift_Codes),1,MATCH(AH13,Shift_Codes,0)+1))))","v":""},null,0,0]
[null,null,null,null,{"$f":"IF(OR($C14=\"\",E$7=\"\"),\"\",IF(D14=\"\",C14,INDEX(Shift_Codes,IF(MATCH(D14,Shift_Codes,0)+1>COUNTA(Shift_Codes),1,MATCH(D14,Shift_Codes,0)+1))))","v":""},{"$f":"IF(OR($C14=\"\",F$7=\"\"),\"\",IF(E14=\"\",D14,INDEX(Shift_Codes,IF(MATCH(E14,Shift_Codes,0)+1>COUNTA(Shift_Codes),1,MATCH(E14,Shift_Codes,0)+1))))","v":""},{"$f":"IF(OR($C14=\"\",G$7=\"\"),\"\",IF(F14=\"\",E14,INDEX(Shift_Codes,IF(MATCH(F14,Shift_Codes,0)+1>COUNTA(Shift_Codes),1,MATCH(F14,Shift_Codes,0)+1))))","v":""},{"$f":"IF(OR($C14=\"\",H$7=\"\"),\"\",IF(G14=\"\",F14,INDEX(Shift_Codes,IF(MATCH(G14,Shift_Codes,0)+1>COUNTA(Shift_Codes),1,MATCH(G14,Shift_Codes,0)+1))))","v":""},{"$f":"IF(OR($C14=\"\",I$7=\"\"),\"\",IF(H14=\"\",G14,INDEX(Shift_Codes,IF(MATCH(H14,Shift_Codes,0)+1>COUNTA(Shift_Codes),1,MATCH(H14,Shift_Codes,0)+1))))","v":""},{"$f":"IF(OR($C14=\"\",J$7=\"\"),\"\",IF(I14=\"\",H14,INDEX(Shift_Codes,IF(MATCH(I14,Shift_Codes,0)+1>COUNTA(Shift_Codes),1,MATCH(I14,Shift_Codes,0)+1))))","v":""},{"$f":"IF(OR($C14=\"\",K$7=\"\"),\"\",IF(J14=\"\",I14,INDEX(Shift_Codes,IF(MATCH(J14,Shift_Codes,0)+1>COUNTA(Shift_Codes),1,MATCH(J14,Shift_Codes,0)+1))))","v":""},{"$f":"IF(OR($C14=\"\",L$7=\"\"),\"\",IF(K14=\"\",J14,INDEX(Shift_Codes,IF(MATCH(K14,Shift_Codes,0)+1>COUNTA(Shift_Codes),1,MATCH(K14,Shift_Codes,0)+1))))","v":""},{"$f":"IF(OR($C14=\"\",M$7=\"\"),\"\",IF(L14=\"\",K14,INDEX(Shift_Codes,IF(MATCH(L14,Shift_Codes,0)+1>COUNTA(Shift_Codes),1,MATCH(L14,Shift_Codes,0)+1))))","v":""},{"$f":"IF(OR($C14=\"\",N$7=\"\"),\"\",IF(M14=\"\",L14,INDEX(Shift_Codes,IF(MATCH(M14,Shift_Codes,0)+1>COUNTA(Shift_Codes),1,MATCH(M14,Shift_Codes,0)+1))))","v":""},{"$f":"IF(OR($C14=\"\",O$7=\"\"),\"\",IF(N14=\"\",M14,INDEX(Shift_Codes,IF(MATCH(N14,Shift_Codes,0)+1>COUNTA(Shift_Codes),1,MATCH(N14,Shift_Codes,0)+1))))","v":""},{"$f":"IF(OR($C14=\"\",P$7=\"\"),\"\",IF(O14=\"\",N14,INDEX(Shift_Codes,IF(MATCH(O14,Shift_Codes,0)+1>COUNTA(Shift_Codes),1,MATCH(O14,Shift_Codes,0)+1))))","v":""},{"$f":"IF(OR($C14=\"\",Q$7=\"\"),\"\",IF(P14=\"\",O14,INDEX(Shift_Codes,IF(MATCH(P14,Shift_Codes,0)+1>COUNTA(Shift_Codes),1,MATCH(P14,Shift_Codes,0)+1))))","v":""},{"$f":"IF(OR($C14=\"\",R$7=\"\"),\"\",IF(Q14=\"\",P14,INDEX(Shift_Codes,IF(MATCH(Q14,Shift_Codes,0)+1>COUNTA(Shift_Codes),1,MATCH(Q14,Shift_Codes,0)+1))))","v":""},{"$f":"IF(OR($C14=\"\",S$7=\"\"),\"\",IF(R14=\"\",Q14,INDEX(Shift_Codes,IF(MATCH(R14,Shift_Codes,0)+1>COUNTA(Shift_Codes),1,MATCH(R14,Shift_Codes,0)+1))))","v":""},{"$f":"IF(OR($C14=\"\",T$7=\"\"),\"\",IF(S14=\"\",R14,INDEX(Shift_Codes,IF(MATCH(S14,Shift_Codes,0)+1>COUNTA(Shift_Codes),1,MATCH(S14,Shift_Codes,0)+1))))","v":""},{"$f":"IF(OR($C14=\"\",U$7=\"\"),\"\",IF(T14=\"\",S14,INDEX(Shift_Codes,IF(MATCH(T14,Shift_Codes,0)+1>COUNTA(Shift_Codes),1,MATCH(T14,Shift_Codes,0)+1))))","v":""},{"$f":"IF(OR($C14=\"\",V$7=\"\"),\"\",IF(U14=\"\",T14,INDEX(Shift_Codes,IF(MATCH(U14,Shift_Codes,0)+1>COUNTA(Shift_Codes),1,MATCH(U14,Shift_Codes,0)+1))))","v":""},{"$f":"IF(OR($C14=\"\",W$7=\"\"),\"\",IF(V14=\"\",U14,INDEX(Shift_Codes,IF(MATCH(V14,Shift_Codes,0)+1>COUNTA(Shift_Codes),1,MATCH(V14,Shift_Codes,0)+1))))","v":""},{"$f":"IF(OR($C14=\"\",X$7=\"\"),\"\",IF(W14=\"\",V14,INDEX(Shift_Codes,IF(MATCH(W14,Shift_Codes,0)+1>COUNTA(Shift_Codes),1,MATCH(W14,Shift_Codes,0)+1))))","v":""},{"$f":"IF(OR($C14=\"\",Y$7=\"\"),\"\",IF(X14=\"\",W14,INDEX(Shift_Codes,IF(MATCH(X14,Shift_Codes,0)+1>COUNTA(Shift_Codes),1,MATCH(X14,Shift_Codes,0)+1))))","v":""},{"$f":"IF(OR($C14=\"\",Z$7=\"\"),\"\",IF(Y14=\"\",X14,INDEX(Shift_Codes,IF(MATCH(Y14,Shift_Codes,0)+1>COUNTA(Shift_Codes),1,MATCH(Y14,Shift_Codes,0)+1))))","v":""},{"$f":"IF(OR($C14=\"\",AA$7=\"\"),\"\",IF(Z14=\"\",Y14,INDEX(Shift_Codes,IF(MATCH(Z14,Shift_Codes,0)+1>COUNTA(Shift_Codes),1,MATCH(Z14,Shift_Codes,0)+1))))","v":""},{"$f":"IF(OR($C14=\"\",AB$7=\"\"),\"\",IF(AA14=\"\",Z14,INDEX(Shift_Codes,IF(MATCH(AA14,Shift_Codes,0)+1>COUNTA(Shift_Codes),1,MATCH(AA14,Shift_Codes,0)+1))))","v":""},{"$f":"IF(OR($C14=\"\",AC$7=\"\"),\"\",IF(AB14=\"\",AA14,INDEX(Shift_Codes,IF(MATCH(AB14,Shift_Codes,0)+1>COUNTA(Shift_Codes),1,MATCH(AB14,Shift_Codes,0)+1))))","v":""},{"$f":"IF(OR($C14=\"\",AD$7=\"\"),\"\",IF(AC14=\"\",AB14,INDEX(Shift_Codes,IF(MATCH(AC14,Shift_Codes,0)+1>COUNTA(Shift_Codes),1,MATCH(AC14,Shift_Codes,0)+1))))","v":""},{"$f":"IF(OR($C14=\"\",AE$7=\"\"),\"\",IF(AD14=\"\",AC14,INDEX(Shift_Codes,IF(MATCH(AD14,Shift_Codes,0)+1>COUNTA(Shift_Codes),1,MATCH(AD14,Shift_Codes,0)+1))))","v":""},{"$f":"IF(OR($C14=\"\",AF$7=\"\"),\"\",IF(AE14=\"\",AD14,INDEX(Shift_Codes,IF(MATCH(AE14,Shift_Codes,0)+1>COUNTA(Shift_Codes),1,MATCH(AE14,Shift_Codes,0)+1))))","v":""},{"$f":"IF(OR($C14=\"\",AG$7=\"\"),\"\",IF(AF14=\"\",AE14,INDEX(Shift_Codes,IF(MATCH(AF14,Shift_Codes,0)+1>COUNTA(Shift_Codes),1,MATCH(AF14,Shift_Codes,0)+1))))","v":""},{"$f":"IF(OR($C14=\"\",AH$7=\"\"),\"\",IF(AG14=\"\",AF14,INDEX(Shift_Codes,IF(MATCH(AG14,Shift_Codes,0)+1>COUNTA(Shift_Codes),1,MATCH(AG14,Shift_Codes,0)+1))))","v":""},{"$f":"IF(OR($C14=\"\",AI$7=\"\"),\"\",IF(AH14=\"\",AG14,INDEX(Shift_Codes,IF(MATCH(AH14,Shift_Codes,0)+1>COUNTA(Shift_Codes),1,MATCH(AH14,Shift_Codes,0)+1))))","v":""},null,0,0]
[null,null,null,null,{"$f":"IF(OR($C15=\"\",E$7=\"\"),\"\",IF(D15=\"\",C15,INDEX(Shift_Codes,IF(MATCH(D15,Shift_Codes,0)+1>COUNTA(Shift_Codes),1,MATCH(D15,Shift_Codes,0)+1))))","v":""},{"$f":"IF(OR($C15=\"\",F$7=\"\"),\"\",IF(E15=\"\",D15,INDEX(Shift_Codes,IF(MATCH(E15,Shift_Codes,0)+1>COUNTA(Shift_Codes),1,MATCH(E15,Shift_Codes,0)+1))))","v":""},{"$f":"IF(OR($C15=\"\",G$7=\"\"),\"\",IF(F15=\"\",E15,INDEX(Shift_Codes,IF(MATCH(F15,Shift_Codes,0)+1>COUNTA(Shift_Codes),1,MATCH(F15,Shift_Codes,0)+1))))","v":""},{"$f":"IF(OR($C15=\"\",H$7=\"\"),\"\",IF(G15=\"\",F15,INDEX(Shift_Codes,IF(MATCH(G15,Shift_Codes,0)+1>COUNTA(Shift_Codes),1,MATCH(G15,Shift_Codes,0)+1))))","v":""},{"$f":"IF(OR($C15=\"\",I$7=\"\"),\"\",IF(H15=\"\",G15,INDEX(Shift_Codes,IF(MATCH(H15,Shift_Codes,0)+1>COUNTA(Shift_Codes),1,MATCH(H15,Shift_Codes,0)+1))))","v":""},{"$f":"IF(OR($C15=\"\",J$7=\"\"),\"\",IF(I15=\"\",H15,INDEX(Shift_Codes,IF(MATCH(I15,Shift_Codes,0)+1>COUNTA(Shift_Codes),1,MATCH(I15,Shift_Codes,0)+1))))","v":""},{"$f":"IF(OR($C15=\"\",K$7=\"\"),\"\",IF(J15=\"\",I15,INDEX(Shift_Codes,IF(MATCH(J15,Shift_Codes,0)+1>COUNTA(Shift_Codes),1,MATCH(J15,Shift_Codes,0)+1))))","v":""},{"$f":"IF(OR($C15=\"\",L$7=\"\"),\"\",IF(K15=\"\",J15,INDEX(Shift_Codes,IF(MATCH(K15,Shift_Codes,0)+1>COUNTA(Shift_Codes),1,MATCH(K15,Shift_Codes,0)+1))))","v":""},{"$f":"IF(OR($C15=\"\",M$7=\"\"),\"\",IF(L15=\"\",K15,INDEX(Shift_Codes,IF(MATCH(L15,Shift_Codes,0)+1>COUNTA(Shift_Codes),1,MATCH(L15,Shift_Codes,0)+1))))","v":""},{"$f":"IF(OR($C15=\"\",N$7=\"\"),\"\",IF(M15=\"\",L15,INDEX(Shift_Codes,IF(MATCH(M15,Shift_Codes,0)+1>COUNTA(Shift_Codes),1,MATCH(M15,Shift_Codes,0)+1))))","v":""},{"$f":"IF(OR($C15=\"\",O$7=\"\"),\"\",IF(N15=\"\",M15,INDEX(Shift_Codes,IF(MATCH(N15,Shift_Codes,0)+1>COUNTA(Shift_Codes),1,MATCH(N15,Shift_Codes,0)+1))))","v":""},{"$f":"IF(OR($C15=\"\",P$7=\"\"),\"\",IF(O15=\"\",N15,INDEX(Shift_Codes,IF(MATCH(O15,Shift_Codes,0)+1>COUNTA(Shift_Codes),1,MATCH(O15,Shift_Codes,0)+1))))","v":""},{"$f":"IF(OR($C15=\"\",Q$7=\"\"),\"\",IF(P15=\"\",O15,INDEX(Shift_Codes,IF(MATCH(P15,Shift_Codes,0)+1>COUNTA(Shift_Codes),1,MATCH(P15,Shift_Codes,0)+1))))","v":""},{"$f":"IF(OR($C15=\"\",R$7=\"\"),\"\",IF(Q15=\"\",P15,INDEX(Shift_Codes,IF(MATCH(Q15,Shift_Codes,0)+1>COUNTA(Shift_Codes),1,MATCH(Q15,Shift_Codes,0)+1))))","v":""},{"$f":"IF(OR($C15=\"\",S$7=\"\"),\"\",IF(R15=\"\",Q15,INDEX(Shift_Codes,IF(MATCH(R15,Shift_Codes,0)+1>COUNTA(Shift_Codes),1,MATCH(R15,Shift_Codes,0)+1))))","v":""},{"$f":"IF(OR($C15=\"\",T$7=\"\"),\"\",IF(S15=\"\",R15,INDEX(Shift_Codes,IF(MATCH(S15,Shift_Codes,0)+1>COUNTA(Shift_Codes),1,MATCH(S15,Shift_Codes,0)+1))))","v":""},{"$f":"IF(OR($C15=\"\",U$7=\"\"),\"\",IF(T15=\"\",S15,INDEX(Shift_Codes,IF(MATCH(T15,Shift_Codes,0)+1>COUNTA(Shift_Codes),1,MATCH(T15,Shift_Codes,0)+1))))","v":""},{"$f":"IF(OR($C15=\"\",V$7=\"\"),\"\",IF(U15=\"\",T15,INDEX(Shift_Codes,IF(MATCH(U15,Shift_Codes,0)+1>COUNTA(Shift_Codes),1,MATCH(U15,Shift_Codes,0)+1))))","v":""},{"$f":"IF(OR($C15=\"\",W$7=\"\"),\"\",IF(V15=\"\",U15,INDEX(Shift_Codes,IF(MATCH(V15,Shift_Codes,0)+1>COUNTA(Shift_Codes),1,MATCH(V15,Shift_Codes,0)+1))))","v":""},{"$f":"IF(OR($C15=\"\",X$7=\"\"),\"\",IF(W15=\"\",V15,INDEX(Shift_Codes,IF(MATCH(W15,Shift_Codes,0)+1>COUNTA(Shift_Codes),1,MATCH(W15,Shift_Codes,0)+1))))","v":""},{"$f":"IF(OR($C15=\"\",Y$7=\"\"),\"\",IF(X15=\"\",W15,INDEX(Shift_Codes,IF(MATCH(X15,Shift_Codes,0)+1>COUNTA(Shift_Codes),1,MATCH(X15,Shift_Codes,0)+1))))","v":""},{"$f":"IF(OR($C15=\"\",Z$7=\"\"),\"\",IF(Y15=\"\",X15,INDEX(Shift_Codes,IF(MATCH(Y15,Shift_Codes,0)+1>COUNTA(Shift_Codes),1,MATCH(Y15,Shift_Codes,0)+1))))","v":""},{"$f":"IF(OR($C15=\"\",AA$7=\"\"),\"\",IF(Z15=\"\",Y15,INDEX(Shift_Codes,IF(MATCH(Z15,Shift_Codes,0)+1>COUNTA(Shift_Codes),1,MATCH(Z15,Shift_Codes,0)+1))))","v":""},{"$f":"IF(OR($C15=\"\",AB$7=\"\"),\"\",IF(AA15=\"\",Z15,INDEX(Shift_Codes,IF(MATCH(AA15,Shift_Codes,0)+1>COUNTA(Shift_Codes),1,MATCH(AA15,Shift_Codes,0)+1))))","v":""},{"$f":"IF(OR($C15=\"\",AC$7=\"\"),\"\",IF(AB15=\"\",AA15,INDEX(Shift_Codes,IF(MATCH(AB15,Shift_Codes,0)+1>COUNTA(Shift_Codes),1,MATCH(AB15,Shift_Codes,0)+1))))","v":""},{"$f":"IF(OR($C15=\"\",AD$7=\"\"),\"\",IF(AC15=\"\",AB15,INDEX(Shift_Codes,IF(MATCH(AC15,Shift_Codes,0)+1>COUNTA(Shift_Codes),1,MATCH(AC15,Shift_Codes,0)+1))))","v":""},{"$f":"IF(OR($C15=\"\",AE$7=\"\"),\"\",IF(AD15=\"\",AC15,INDEX(Shift_Codes,IF(MATCH(AD15,Shift_Codes,0)+1>COUNTA(Shift_Codes),1,MATCH(AD15,Shift_Codes,0)+1))))","v":""},{"$f":"IF(OR($C15=\"\",AF$7=\"\"),\"\",IF(AE15=\"\",AD15,INDEX(Shift_Codes,IF(MATCH(AE15,Shift_Codes,0)+1>COUNTA(Shift_Codes),1,MATCH(AE15,Shift_Codes,0)+1))))","v":""},{"$f":"IF(OR($C15=\"\",AG$7=\"\"),\"\",IF(AF15=\"\",AE15,INDEX(Shift_Codes,IF(MATCH(AF15,Shift_Codes,0)+1>COUNTA(Shift_Codes),1,MATCH(AF15,Shift_Codes,0)+1))))","v":""},{"$f":"IF(OR($C15=\"\",AH$7=\"\"),\"\",IF(AG15=\"\",AF15,INDEX(Shift_Codes,IF(MATCH(AG15,Shift_Codes,0)+1>COUNTA(Shift_Codes),1,MATCH(AG15,Shift_Codes,0)+1))))","v":""},{"$f":"IF(OR($C15=\"\",AI$7=\"\"),\"\",IF(AH15=\"\",AG15,INDEX(Shift_Codes,IF(MATCH(AH15,Shift_Codes,0)+1>COUNTA(Shift_Codes),1,MATCH(AH15,Shift_Codes,0)+1))))","v":""},null,0,0]
[null,null,null,null,{"$f":"IF(OR($C16=\"\",E$7=\"\"),\"\",IF(D16=\"\",C16,INDEX(Shift_Codes,IF(MATCH(D16,Shift_Codes,0)+1>COUNTA(Shift_Codes),1,MATCH(D16,Shift_Codes,0)+1))))","v":""},{"$f":"IF(OR($C16=\"\",F$7=\"\"),\"\",IF(E16=\"\",D16,INDEX(Shift_Codes,IF(MATCH(E16,Shift_Codes,0)+1>COUNTA(Shift_Codes),1,MATCH(E16,Shift_Codes,0)+1))))","v":""},{"$f":"IF(OR($C16=\"\",G$7=\"\"),\"\",IF(F16=\"\",E16,INDEX(Shift_Codes,IF(MATCH(F16,Shift_Codes,0)+1>COUNTA(Shift_Codes),1,MATCH(F16,Shift_Codes,0)+1))))","v":""},{"$f":"IF(OR($C16=\"\",H$7=\"\"),\"\",IF(G16=\"\",F16,INDEX(Shift_Codes,IF(MATCH(G16,Shift_Codes,0)+1>COUNTA(Shift_Codes),1,MATCH(G16,Shift_Codes,0)+1))))","v":""},{"$f":"IF(OR($C16=\"\",I$7=\"\"),\"\",IF(H16=\"\",G16,INDEX(Shift_Codes,IF(MATCH(H16,Shift_Codes,0)+1>COUNTA(Shift_Codes),1,MATCH(H16,Shift_Codes,0)+1))))","v":""},{"$f":"IF(OR($C16=\"\",J$7=\"\"),\"\",IF(I16=\"\",H16,INDEX(Shift_Codes,IF(MATCH(I16,Shift_Codes,0)+1>COUNTA(Shift_Codes),1,MATCH(I16,Shift_Codes,0)+1))))","v":""},{"$f":"IF(OR($C16=\"\",K$7=\"\"),\"\",IF(J16=\"\",I16,INDEX(Shift_Codes,IF(MATCH(J16,Shift_Codes,0)+1>COUNTA(Shift_Codes),1,MATCH(J16,Shift_Codes,0)+1))))","v":""},{"$f":"IF(OR($C16=\"\",L$7=\"\"),\"\",IF(K16=\"\",J16,INDEX(Shift_Codes,IF(MATCH(K16,Shift_Codes,0)+1>COUNTA(Shift_Codes),1,MATCH(K16,Shift_Codes,0)+1))))","v":""},{"$f":"IF(OR($C16=\"\",M$7=\"\"),\"\",IF(L16=\"\",K16,INDEX(Shift_Codes,IF(MATCH(L16,Shift_Codes,0)+1>COUNTA(Shift_Codes),1,MATCH(L16,Shift_Codes,0)+1))))","v":""},{"$f":"IF(OR($C16=\"\",N$7=\"\"),\"\",IF(M16=\"\",L16,INDEX(Shift_Codes,IF(MATCH(M16,Shift_Codes,0)+1>COUNTA(Shift_Codes),1,MATCH(M16,Shift_Codes,0)+1))))","v":""},{"$f":"IF(OR($C16=\"\",O$7=\"\"),\"\",IF(N16=\"\",M16,INDEX(Shift_Codes,IF(MATCH(N16,Shift_Codes,0)+1>COUNTA(Shift_Codes),1,MATCH(N16,Shift_Codes,0)+1))))","v":""},{"$f":"IF(OR($C16=\"\",P$7=\"\"),\"\",IF(O16=\"\",N16,INDEX(Shift_Codes,IF(MATCH(O16,Shift_Codes,0)+1>COUNTA(Shift_Codes),1,MATCH(O16,Shift_Codes,0)+1))))","v":""},{"$f":"IF(OR($C16=\"\",Q$7=\"\"),\"\",IF(P16=\"\",O16,INDEX(Shift_Codes,IF(MATCH(P16,Shift_Codes,0)+1>COUNTA(Shift_Codes),1,MATCH(P16,Shift_Codes,0)+1))))","v":""},{"$f":"IF(OR($C16=\"\",R$7=\"\"),\"\",IF(Q16=\"\",P16,INDEX(Shift_Codes,IF(MATCH(Q16,Shift_Codes,0)+1>COUNTA(Shift_Codes),1,MATCH(Q16,Shift_Codes,0)+1))))","v":""},{"$f":"IF(OR($C16=\"\",S$7=\"\"),\"\",IF(R16=\"\",Q16,INDEX(Shift_Codes,IF(MATCH(R16,Shift_Codes,0)+1>COUNTA(Shift_Codes),1,MATCH(R16,Shift_Codes,0)+1))))","v":""},{"$f":"IF(OR($C16=\"\",T$7=\"\"),\"\",IF(S16=\"\",R16,INDEX(Shift_Codes,IF(MATCH(S16,Shift_Codes,0)+1>COUNTA(Shift_Codes),1,MATCH(S16,Shift_Codes,0)+1))))","v":""},{"$f":"IF(OR($C16=\"\",U$7=\"\"),\"\",IF(T16=\"\",S16,INDEX(Shift_Codes,IF(MATCH(T16,Shift_Codes,0)+1>COUNTA(Shift_Codes),1,MATCH(T16,Shift_Codes,0)+1))))","v":""},{"$f":"IF(OR($C16=\"\",V$7=\"\"),\"\",IF(U16=\"\",T16,INDEX(Shift_Codes,IF(MATCH(U16,Shift_Codes,0)+1>COUNTA(Shift_Codes),1,MATCH(U16,Shift_Codes,0)+1))))","v":""},{"$f":"IF(OR($C16=\"\",W$7=\"\"),\"\",IF(V16=\"\",U16,INDEX(Shift_Codes,IF(MATCH(V16,Shift_Codes,0)+1>COUNTA(Shift_Codes),1,MATCH(V16,Shift_Codes,0)+1))))","v":""},{"$f":"IF(OR($C16=\"\",X$7=\"\"),\"\",IF(W16=\"\",V16,INDEX(Shift_Codes,IF(MATCH(W16,Shift_Codes,0)+1>COUNTA(Shift_Codes),1,MATCH(W16,Shift_Codes,0)+1))))","v":""},{"$f":"IF(OR($C16=\"\",Y$7=\"\"),\"\",IF(X16=\"\",W16,INDEX(Shift_Codes,IF(MATCH(X16,Shift_Codes,0)+1>COUNTA(Shift_Codes),1,MATCH(X16,Shift_Codes,0)+1))))","v":""},{"$f":"IF(OR($C16=\"\",Z$7=\"\"),\"\",IF(Y16=\"\",X16,INDEX(Shift_Codes,IF(MATCH(Y16,Shift_Codes,0)+1>COUNTA(Shift_Codes),1,MATCH(Y16,Shift_Codes,0)+1))))","v":""},{"$f":"IF(OR($C16=\"\",AA$7=\"\"),\"\",IF(Z16=\"\",Y16,INDEX(Shift_Codes,IF(MATCH(Z16,Shift_Codes,0)+1>COUNTA(Shift_Codes),1,MATCH(Z16,Shift_Codes,0)+1))))","v":""},{"$f":"IF(OR($C16=\"\",AB$7=\"\"),\"\",IF(AA16=\"\",Z16,INDEX(Shift_Codes,IF(MATCH(AA16,Shift_Codes,0)+1>COUNTA(Shift_Codes),1,MATCH(AA16,Shift_Codes,0)+1))))","v":""},{"$f":"IF(OR($C16=\"\",AC$7=\"\"),\"\",IF(AB16=\"\",AA16,INDEX(Shift_Codes,IF(MATCH(AB16,Shift_Codes,0)+1>COUNTA(Shift_Codes),1,MATCH(AB16,Shift_Codes,0)+1))))","v":""},{"$f":"IF(OR($C16=\"\",AD$7=\"\"),\"\",IF(AC16=\"\",AB16,INDEX(Shift_Codes,IF(MATCH(AC16,Shift_Codes,0)+1>COUNTA(Shift_Codes),1,MATCH(AC16,Shift_Codes,0)+1))))","v":""},{"$f":"IF(OR($C16=\"\",AE$7=\"\"),\"\",IF(AD16=\"\",AC16,INDEX(Shift_Codes,IF(MATCH(AD16,Shift_Codes,0)+1>COUNTA(Shift_Codes),1,MATCH(AD16,Shift_Codes,0)+1))))","v":""},{"$f":"IF(OR($C16=\"\",AF$7=\"\"),\"\",IF(AE16=\"\",AD16,INDEX(Shift_Codes,IF(MATCH(AE16,Shift_Codes,0)+1>COUNTA(Shift_Codes),1,MATCH(AE16,Shift_Codes,0)+1))))","v":""},{"$f":"IF(OR($C16=\"\",AG$7=\"\"),\"\",IF(AF16=\"\",AE16,INDEX(Shift_Codes,IF(MATCH(AF16,Shift_Codes,0)+1>COUNTA(Shift_Codes),1,MATCH(AF16,Shift_Codes,0)+1))))","v":""},{"$f":"IF(OR($C16=\"\",AH$7=\"\"),\"\",IF(AG16=\"\",AF16,INDEX(Shift_Codes,IF(MATCH(AG16,Shift_Codes,0)+1>COUNTA(Shift_Codes),1,MATCH(AG16,Shift_Codes,0)+1))))","v":""},{"$f":"IF(OR($C16=\"\",AI$7=\"\"),\"\",IF(AH16=\"\",AG16,INDEX(Shift_Codes,IF(MATCH(AH16,Shift_Codes,0)+1>COUNTA(Shift_Codes),1,MATCH(AH16,Shift_Codes,0)+1))))","v":""},null,0,0]
[null,null,null,null,{"$f":"IF(OR($C17=\"\",E$7=\"\"),\"\",IF(D17=\"\",C17,INDEX(Shift_Codes,IF(MATCH(D17,Shift_Codes,0)+1>COUNTA(Shift_Codes),1,MATCH(D17,Shift_Codes,0)+1))))","v":""},{"$f":"IF(OR($C17=\"\",F$7=\"\"),\"\",IF(E17=\"\",D17,INDEX(Shift_Codes,IF(MATCH(E17,Shift_Codes,0)+1>COUNTA(Shift_Codes),1,MATCH(E17,Shift_Codes,0)+1))))","v":""},{"$f":"IF(OR($C17=\"\",G$7=\"\"),\"\",IF(F17=\"\",E17,INDEX(Shift_Codes,IF(MATCH(F17,Shift_Codes,0)+1>COUNTA(Shift_Codes),1,MATCH(F17,Shift_Codes,0)+1))))","v":""},{"$f":"IF(OR($C17=\"\",H$7=\"\"),\"\",IF(G17=\"\",F17,INDEX(Shift_Codes,IF(MATCH(G17,Shift_Codes,0)+1>COUNTA(Shift_Codes),1,MATCH(G17,Shift_Codes,0)+1))))","v":""},{"$f":"IF(OR($C17=\"\",I$7=\"\"),\"\",IF(H17=\"\",G17,INDEX(Shift_Codes,IF(MATCH(H17,Shift_Codes,0)+1>COUNTA(Shift_Codes),1,MATCH(H17,Shift_Codes,0)+1))))","v":""},{"$f":"IF(OR($C17=\"\",J$7=\"\"),\"\",IF(I17=\"\",H17,INDEX(Shift_Codes,IF(MATCH(I17,Shift_Codes,0)+1>COUNTA(Shift_Codes),1,MATCH(I17,Shift_Codes,0)+1))))","v":""},{"$f":"IF(OR($C17=\"\",K$7=\"\"),\"\",IF(J17=\"\",I17,INDEX(Shift_Codes,IF(MATCH(J17,Shift_Codes,0)+1>COUNTA(Shift_Codes),1,MATCH(J17,Shift_Codes,0)+1))))","v":""},{"$f":"IF(OR($C17=\"\",L$7=\"\"),\"\",IF(K17=\"\",J17,INDEX(Shift_Codes,IF(MATCH(K17,Shift_Codes,0)+1>COUNTA(Shift_Codes),1,MATCH(K17,Shift_Codes,0)+1))))","v":""},{"$f":"IF(OR($C17=\"\",M$7=\"\"),\"\",IF(L17=\"\",K17,INDEX(Shift_Codes,IF(MATCH(L17,Shift_Codes,0)+1>COUNTA(Shift_Codes),1,MATCH(L17,Shift_Codes,0)+1))))","v":""},{"$f":"IF(OR($C17=\"\",N$7=\"\"),\"\",IF(M17=\"\",L17,INDEX(Shift_Codes,IF(MATCH(M17,Shift_Codes,0)+1>COUNTA(Shift_Codes),1,MATCH(M17,Shift_Codes,0)+1))))","v":""},{"$f":"IF(OR($C17=\"\",O$7=\"\"),\"\",IF(N17=\"\",M17,INDEX(Shift_Codes,IF(MATCH(N17,Shift_Codes,0)+1>COUNTA(Shift_Codes),1,MATCH(N17,Shift_Codes,0)+1))))","v":""},{"$f":"IF(OR($C17=\"\",P$7=\"\"),\"\",IF(O17=\"\",N17,INDEX(Shift_Codes,IF(MATCH(O17,Shift_Codes,0)+1>COUNTA(Shift_Codes),1,MATCH(O17,Shift_Codes,0)+1))))","v":""},{"$f":"IF(OR($C17=\"\",Q$7=\"\"),\"\",IF(P17=\"\",O17,INDEX(Shift_Codes,IF(MATCH(P17,Shift_Codes,0)+1>COUNTA(Shift_Codes),1,MATCH(P17,Shift_Codes,0)+1))))","v":""},{"$f":"IF(OR($C17=\"\",R$7=\"\"),\"\",IF(Q17=\"\",P17,INDEX(Shift_Codes,IF(MATCH(Q17,Shift_Codes,0)+1>COUNTA(Shift_Codes),1,MATCH(Q17,Shift_Codes,0)+1))))","v":""},{"$f":"IF(OR($C17=\"\",S$7=\"\"),\"\",IF(R17=\"\",Q17,INDEX(Shift_Codes,IF(MATCH(R17,Shift_Codes,0)+1>COUNTA(Shift_Codes),1,MATCH(R17,Shift_Codes,0)+1))))","v":""},{"$f":"IF(OR($C17=\"\",T$7=\"\"),\"\",IF(S17=\"\",R17,INDEX(Shift_Codes,IF(MATCH(S17,Shift_Codes,0)+1>COUNTA(Shift_Codes),1,MATCH(S17,Shift_Codes,0)+1))))","v":""},{"$f":"IF(OR($C17=\"\",U$7=\"\"),\"\",IF(T17=\"\",S17,INDEX(Shift_Codes,IF(MATCH(T17,Shift_Codes,0)+1>COUNTA(Shift_Codes),1,MATCH(T17,Shift_Codes,0)+1))))","v":""},{"$f":"IF(OR($C17=\"\",V$7=\"\"),\"\",IF(U17=\"\",T17,INDEX(Shift_Codes,IF(MATCH(U17,Shift_Codes,0)+1>COUNTA(Shift_Codes),1,MATCH(U17,Shift_Codes,0)+1))))","v":""},{"$f":"IF(OR($C17=\"\",W$7=\"\"),\"\",IF(V17=\"\",U17,INDEX(Shift_Codes,IF(MATCH(V17,Shift_Codes,0)+1>COUNTA(Shift_Codes),1,MATCH(V17,Shift_Codes,0)+1))))","v":""},{"$f":"IF(OR($C17=\"\",X$7=\"\"),\"\",IF(W17=\"\",V17,INDEX(Shift_Codes,IF(MATCH(W17,Shift_Codes,0)+1>COUNTA(Shift_Codes),1,MATCH(W17,Shift_Codes,0)+1))))","v":""},{"$f":"IF(OR($C17=\"\",Y$7=\"\"),\"\",IF(X17=\"\",W17,INDEX(Shift_Codes,IF(MATCH(X17,Shift_Codes,0)+1>COUNTA(Shift_Codes),1,MATCH(X17,Shift_Codes,0)+1))))","v":""},{"$f":"IF(OR($C17=\"\",Z$7=\"\"),\"\",IF(Y17=\"\",X17,INDEX(Shift_Codes,IF(MATCH(Y17,Shift_Codes,0)+1>COUNTA(Shift_Codes),1,MATCH(Y17,Shift_Codes,0)+1))))","v":""},{"$f":"IF(OR($C17=\"\",AA$7=\"\"),\"\",IF(Z17=\"\",Y17,INDEX(Shift_Codes,IF(MATCH(Z17,Shift_Codes,0)+1>COUNTA(Shift_Codes),1,MATCH(Z17,Shift_Codes,0)+1))))","v":""},{"$f":"IF(OR($C17=\"\",AB$7=\"\"),\"\",IF(AA17=\"\",Z17,INDEX(Shift_Codes,IF(MATCH(AA17,Shift_Codes,0)+1>COUNTA(Shift_Codes),1,MATCH(AA17,Shift_Codes,0)+1))))","v":""},{"$f":"IF(OR($C17=\"\",AC$7=\"\"),\"\",IF(AB17=\"\",AA17,INDEX(Shift_Codes,IF(MATCH(AB17,Shift_Codes,0)+1>COUNTA(Shift_Codes),1,MATCH(AB17,Shift_Codes,0)+1))))","v":""},{"$f":"IF(OR($C17=\"\",AD$7=\"\"),\"\",IF(AC17=\"\",AB17,INDEX(Shift_Codes,IF(MATCH(AC17,Shift_Codes,0)+1>COUNTA(Shift_Codes),1,MATCH(AC17,Shift_Codes,0)+1))))","v":""},{"$f":"IF(OR($C17=\"\",AE$7=\"\"),\"\",IF(AD17=\"\",AC17,INDEX(Shift_Codes,IF(MATCH(AD17,Shift_Codes,0)+1>COUNTA(Shift_Codes),1,MATCH(AD17,Shift_Codes,0)+1))))","v":""},{"$f":"IF(OR($C17=\"\",AF$7=\"\"),\"\",IF(AE17=\"\",AD17,INDEX(Shift_Codes,IF(MATCH(AE17,Shift_Codes,0)+1>COUNTA(Shift_Codes),1,MATCH(AE17,Shift_Codes,0)+1))))","v":""},{"$f":"IF(OR($C17=\"\",AG$7=\"\"),\"\",IF(AF17=\"\",AE17,INDEX(Shift_Codes,IF(MATCH(AF17,Shift_Codes,0)+1>COUNTA(Shift_Codes),1,MATCH(AF17,Shift_Codes,0)+1))))","v":""},{"$f":"IF(OR($C17=\"\",AH$7=\"\"),\"\",IF(AG17=\"\",AF17,INDEX(Shift_Codes,IF(MATCH(AG17,Shift_Codes,0)+1>COUNTA(Shift_Codes),1,MATCH(AG17,Shift_Codes,0)+1))))","v":""},{"$f":"IF(OR($C17=\"\",AI$7=\"\"),\"\",IF(AH17=\"\",AG17,INDEX(Shift_Codes,IF(MATCH(AH17,Shift_Codes,0)+1>COUNTA(Shift_Codes),1,MATCH(AH17,Shift_Codes,0)+1))))","v":""},null,0,0]
[]
[null,"Total Day Shift Employees",null,null,{"$f":"COUNTIF(E$8:E$17,\"D*\")","v":1},{"$f":"COUNTIF(F$8:F$17,\"D*\")","v":0},0,0,1,1,1,0,0,0,1,1,1,0,0,0,1,1,1,0,0,0,1,1,1,0,0,0,1,1,1]
[null,"Total Night Shift Employees",null,null,{"$f":"COUNTIF(E$8:E$17,\"N*\")","v":0},{"$f":"COUNTIF(F$8:F$17,\"N*\")","v":1},1,1,0,0,0,1,1,1,0,0,0,1,1,1,0,0,0,1,1,1,0,0,0,1,1,1,0,0,0]

{"sheet":"May 2021","index":4,"n_rows":20,"n_cols":38,"rows_kept":20,"cut":false,"hidden":false,"merged":[[19,1,19,2],[5,1,6,1],[5,2,6,2],[5,36,6,36],[5,37,6,37],[6,3,16,3],[18,1,18,2],[3,18,3,19],[3,20,3,22],[3,23,3,25],[3,26,3,27],[3,28,3,30],[3,32,3,34],[1,1,3,2],[1,4,2,21],[1,22,2,27],[1,28,2,31],[1,32,2,34],[1,36,3,37],[3,4,3,8],[3,10,3,11],[3,12,3,14],[3,15,3,17]]}
[]
[null,"Logo",null,null,"Roster of",null,null,null,null,null,null,null,null,null,null,null,null,null,null,null,null,null,"May",null,null,null,null,null,2021,null,null,null,null,null,null,null,"Final Report"]
[]
[null,null,null,null,"Month Starting Date:",null,null,null,null,1,null,null,"Start Date:",null,null,{"$f":"IFERROR(DATEVALUE(J4&W2&AC2),\"\")","v":"2021-05-01"},null,null,null,null,"End Date:",null,null,{"$f":"IFERROR(EOMONTH(P4,0)+J4-1,\"\")","v":"2021-05-31"},null,null,null,null,"Total Days:",null,null,{"$f":"X4-P4+1","v":31}]
[]
[null,"Employee","Starting Shift",null,{"$f":"TEXT(E7,\"ddd\")","v":"Sat"},{"$f":"TEXT(F7,\"ddd\")","v":"Sun"},"Mon","Tue","Wed","Thu","Fri","Sat","Sun","Mon","Tue","Wed","Thu","Fri","Sat","Sun","Mon","Tue","Wed","Thu","Fri","Sat","Sun","Mon","Tue","Wed","Thu","Fri","Sat","Sun","Mon",null,"Total Day Shifts","Total Night Shifts"]
[null,null,null,null,{"$f":"P4","v":"2021-05-01"},{"$f":"IF(E7>=$X$4,\"\",E7+1)","v":"2021-05-02"},"2021-05-03","2021-05-04","2021-05-05","2021-05-06","2021-05-07","2021-05-08","2021-05-09","2021-05-10","2021-05-11","2021-05-12","2021-05-13","2021-05-14","2021-05-15","2021-05-16","2021-05-17","2021-05-18","2021-05-19","2021-05-20","2021-05-21","2021-05-22","2021-05-23","2021-05-24","2021-05-25","2021-05-26","2021-05-27","2021-05-28","2021-05-29","2021-05-30","2021-05-31"]
[null,"Jack","D3",null,{"$f":"IF(OR($C8=\"\",E$7=\"\"),\"\",IF(D8=\"\",C8,INDEX(Shift_Codes,IF(MATCH(D8,Shift_Codes,0)+1>COUNTA(Shift_Codes),1,MATCH(D8,Shift_Codes,0)+1))))","v":"D3"},{"$f":"IF(OR($C8=\"\",F$7=\"\"),\"\",IF(E8=\"\",D8,INDEX(Shift_Codes,IF(MATCH(E8,Shift_Codes,0)+1>COUNTA(Shift_Codes),1,MATCH(E8,Shift_Codes,0)+1))))","v":"N1"},{"$f":"IF(OR($C8=\"\",G$7=\"\"),\"\",IF(F8=\"\",E8,INDEX(Shift_Codes,IF(MATCH(F8,Shift_Codes,0)+1>COUNTA(Shift_Codes),1,MATCH(F8,Shift_Codes,0)+1))))","v":"N2"},{"$f":"IF(OR($C8=\"\",H$7=\"\"),\"\",IF(G8=\"\",F8,INDEX(Shift_Codes,IF(MATCH(G8,Shift_Codes,0)+1>COUNTA(Shift_Codes),1,MATCH(G8,Shift_Codes,0)+1))))","v":"N3"},{"$f":"IF(OR($C8=\"\",I$7=\"\"),\"\",IF(H8=\"\",G8,INDEX(Shift_Codes,IF(MATCH(H8,Shift_Codes,0)+1>COUNTA(Shift_Codes),1,MATCH(H8,Shift_Codes,0)+1))))","v":"D1"},{"$f":"IF(OR($C8=\"\",J$7=\"\"),\"\",IF(I8=\"\",H8,INDEX(Shift_Codes,IF(MATCH(I8,Shift_Codes,0)+1>COUNTA(Shift_Codes),1,MATCH(I8,Shift_Codes,0)+1))))","v":"D2"},{"$f":"IF(OR($C8=\"\",K$7=\"\"),\"\",IF(J8=\"\",I8,INDEX(Shift_Codes,IF(MATCH(J8,Shift_Codes,0)+1>COUNTA(Shift_Codes),1,MATCH(J8,Shift_Codes,0)+1))))","v":"D3"},{"$f":"IF(OR($C8=\"\",L$7=\"\"),\"\",IF(K8=\"\",J8,INDEX(Shift_Codes,IF(MATCH(K8,Shift_Codes,0)+1>COUNTA(Shift_Codes),1,MATCH(K8,Shift_Codes,0)+1))))","v":"N1"},{"$f":"IF(OR($C8=\"\",M$7=\"\"),\"\",IF(L8=\"\",K8,INDEX(Shift_Codes,IF(MATCH(L8,Shift_Codes,0)+1>COUNTA(Shift_Codes),1,MATCH(L8,Shift_Codes,0)+1))))","v":"N2"},{"$f":"IF(OR($C8=\"\",N$7=\"\"),\"\",IF(M8=\"\",L8,INDEX(Shift_Codes,IF(MATCH(M8,Shift_Codes,0)+1>COUNTA(Shift_Codes),1,MATCH(M8,Shift_Codes,0)+1))))","v":"N3"},{"$f":"IF(OR($C8=\"\",O$7=\"\"),\"\",IF(N8=\"\",M8,INDEX(Shift_Codes,IF(MATCH(N8,Shift_Codes,0)+1>COUNTA(Shift_Codes),1,MATCH(N8,Shift_Codes,0)+1))))","v":"D1"},{"$f":"IF(OR($C8=\"\",P$7=\"\"),\"\",IF(O8=\"\",N8,INDEX(Shift_Codes,IF(MATCH(O8,Shift_Codes,0)+1>COUNTA(Shift_Codes),1,MATCH(O8,Shift_Codes,0)+1))))","v":"D2"},{"$f":"IF(OR($C8=\"\",Q$7=\"\"),\"\",IF(P8=\"\",O8,INDEX(Shift_Codes,IF(MATCH(P8,Shift_Codes,0)+1>COUNTA(Shift_Codes),1,MATCH(P8,Shift_Codes,0)+1))))","v":"D3"},{"$f":"IF(OR($C8=\"\",R$7=\"\"),\"\",IF(Q8=\"\",P8,INDEX(Shift_Codes,IF(MATCH(Q8,Shift_Codes,0)+1>COUNTA(Shift_Codes),1,MATCH(Q8,Shift_Codes,0)+1))))","v":"N1"},{"$f":"IF(OR($C8=\"\",S$7=\"\"),\"\",IF(R8=\"\",Q8,INDEX(Shift_Codes,IF(MATCH(R8,Shift_Codes,0)+1>COUNTA(Shift_Codes),1,MATCH(R8,Shift_Codes,0)+1))))","v":"N2"},{"$f":"IF(OR($C8=\"\",T$7=\"\"),\"\",IF(S8=\"\",R8,INDEX(Shift_Codes,IF(MATCH(S8,Shift_Codes,0)+1>COUNTA(Shift_Codes),1,MATCH(S8,Shift_Codes,0)+1))))","v":"N3"},{"$f":"IF(OR($C8=\"\",U$7=\"\"),\"\",IF(T8=\"\",S8,INDEX(Shift_Codes,IF(MATCH(T8,Shift_Codes,0)+1>COUNTA(Shift_Codes),1,MATCH(T8,Shift_Codes,0)+1))))","v":"D1"},{"$f":"IF(OR($C8=\"\",V$7=\"\"),\"\",IF(U8=\"\",T8,INDEX(Shift_Codes,IF(MATCH(U8,Shift_Codes,0)+1>COUNTA(Shift_Codes),1,MATCH(U8,Shift_Codes,0)+1))))","v":"D2"},{"$f":"IF(OR($C8=\"\",W$7=\"\"),\"\",IF(V8=\"\",U8,INDEX(Shift_Codes,IF(MATCH(V8,Shift_Codes,0)+1>COUNTA(Shift_Codes),1,MATCH(V8,Shift_Codes,0)+1))))","v":"D3"},{"$f":"IF(OR($C8=\"\",X$7=\"\"),\"\",IF(W8=\"\",V8,INDEX(Shift_Codes,IF(MATCH(W8,Shift_Codes,0)+1>COUNTA(Shift_Codes),1,MATCH(W8,Shift_Codes,0)+1))))","v":"N1"},{"$f":"IF(OR($C8=\"\",Y$7=\"\"),\"\",IF(X8=\"\",W8,INDEX(Shift_Codes,IF(MATCH(X8,Shift_Codes,0)+1>COUNTA(Shift_Codes),1,MATCH(X8,Shift_Codes,0)+1))))","v":"N2"},{"$f":"IF(OR($C8=\"\",Z$7=\"\"),\"\",IF(Y8=\"\",X8,INDEX(Shift_Codes,IF(MATCH(Y8,Shift_Codes,0)+1>COUNTA(Shift_Codes),1,MATCH(Y8,Shift_Codes,0)+1))))","v":"N3"},{"$f":"IF(OR($C8=\"\",AA$7=\"\"),\"\",IF(Z8=\"\",Y8,INDEX(Shift_Codes,IF(MATCH(Z8,Shift_Codes,0)+1>COUNTA(Shift_Codes),1,MATCH(Z8,Shift_Codes,0)+1))))","v":"D1"},{"$f":"IF(OR($C8=\"\",AB$7=\"\"),\"\",IF(AA8=\"\",Z8,INDEX(Shift_Codes,IF(MATCH(AA8,Shift_Codes,0)+1>COUNTA(Shift_Codes),1,MATCH(AA8,Shift_Codes,0)+1))))","v":"D2"},{"$f":"IF(OR($C8=\"\",AC$7=\"\"),\"\",IF(AB8=\"\",AA8,INDEX(Shift_Codes,IF(MATCH(AB8,Shift_Codes,0)+1>COUNTA(Shift_Codes),1,MATCH(AB8,Shift_Codes,0)+1))))","v":"D3"},{"$f":"IF(OR($C8=\"\",AD$7=\"\"),\"\",IF(AC8=\"\",AB8,INDEX(Shift_Codes,IF(MATCH(AC8,Shift_Codes,0)+1>COUNTA(Shift_Codes),1,MATCH(AC8,Shift_Codes,0)+1))))","v":"N1"},{"$f":"IF(OR($C8=\"\",AE$7=\"\"),\"\",IF(AD8=\"\",AC8,INDEX(Shift_Codes,IF(MATCH(AD8,Shift_Codes,0)+1>COUNTA(Shift_Codes),1,MATCH(AD8,Shift_Codes,0)+1))))","v":"N2"},{"$f":"IF(OR($C8=\"\",AF$7=\"\"),\"\",IF(AE8=\"\",AD8,INDEX(Shift_Codes,IF(MATCH(AE8,Shift_Codes,0)+1>COUNTA(Shift_Codes),1,MATCH(AE8,Shift_Codes,0)+1))))","v":"N3"},{"$f":"IF(OR($C8=\"\",AG$7=\"\"),\"\",IF(AF8=\"\",AE8,INDEX(Shift_Codes,IF(MATCH(AF8,Shift_Codes,0)+1>COUNTA(Shift_Codes),1,MATCH(AF8,Shift_Codes,0)+1))))","v":"D1"},{"$f":"IF(OR($C8=\"\",AH$7=\"\"),\"\",IF(AG8=\"\",AF8,INDEX(Shift_Codes,IF(MATCH(AG8,Shift_Codes,0)+1>COUNTA(Shift_Codes),1,MATCH(AG8,Shift_Codes,0)+1))))","v":"D2"},{"$f":"IF(OR($C8=\"\",AI$7=\"\"),\"\",IF(AH8=\"\",AG8,INDEX(Shift_Codes,IF(MATCH(AH8,Shift_Codes,0)+1>COUNTA(Shift_Codes),1,MATCH(AH8,Shift_Codes,0)+1))))","v":"D3"},null,{"$f":"COUNTIF($E8:$AI8,\"D*\")","v":16},{"$f":"COUNTIF($E8:$AI8,\"N*\")","v":15}]
[null,"Bill",null,null,{"$f":"IF(OR($C9=\"\",E$7=\"\"),\"\",IF(D9=\"\",C9,INDEX(Shift_Codes,IF(MATCH(D9,Shift_Codes,0)+1>COUNTA(Shift_Codes),1,MATCH(D9,Shift_Codes,0)+1))))","v":""},{"$f":"IF(OR($C9=\"\",F$7=\"\"),\"\",IF(E9=\"\",D9,INDEX(Shift_Codes,IF(MATCH(E9,Shift_Codes,0)+1>COUNTA(Shift_Codes),1,MATCH(E9,Shift_Codes,0)+1))))","v":""},{"$f":"IF(OR($C9=\"\",G$7=\"\"),\"\",IF(F9=\"\",E9,INDEX(Shift_Codes,IF(MATCH(F9,Shift_Codes,0)+1>COUNTA(Shift_Codes),1,MATCH(F9,Shift_Codes,0)+1))))","v":""},{"$f":"IF(OR($C9=\"\",H$7=\"\"),\"\",IF(G9=\"\",F9,INDEX(Shift_Codes,IF(MATCH(G9,Shift_Codes,0)+1>COUNTA(Shift_Codes),1,MATCH(G9,Shift_Codes,0)+1))))","v":""},{"$f":"IF(OR($C9=\"\",I$7=\"\"),\"\",IF(H9=\"\",G9,INDEX(Shift_Codes,IF(MATCH(H9,Shift_Codes,0)+1>COUNTA(Shift_Codes),1,MATCH(H9,Shift_Codes,0)+1))))","v":""},{"$f":"IF(OR($C9=\"\",J$7=\"\"),\"\",IF(I9=\"\",H9,INDEX(Shift_Codes,IF(MATCH(I9,Shift_Codes,0)+1>COUNTA(Shift_Codes),1,MATCH(I9,Shift_Codes,0)+1))))","v":""},{"$f":"IF(OR($C9=\"\",K$7=\"\"),\"\",IF(J9=\"\",I9,INDEX(Shift_Codes,IF(MATCH(J9,Shift_Codes,0)+1>COUNTA(Shift_Codes),1,MATCH(J9,Shift_Codes,0)+1))))","v":""},{"$f":"IF(OR($C9=\"\",L$7=\"\"),\"\",IF(K9=\"\",J9,INDEX(Shift_Codes,IF(MATCH(K9,Shift_Codes,0)+1>COUNTA(Shift_Codes),1,MATCH(K9,Shift_Codes,0)+1))))","v":""},{"$f":"IF(OR($C9=\"\",M$7=\"\"),\"\",IF(L9=\"\",K9,INDEX(Shift_Codes,IF(MATCH(L9,Shift_Codes,0)+1>COUNTA(Shift_Codes),1,MATCH(L9,Shift_Codes,0)+1))))","v":""},{"$f":"IF(OR($C9=\"\",N$7=\"\"),\"\",IF(M9=\"\",L9,INDEX(Shift_Codes,IF(MATCH(M9,Shift_Codes,0)+1>COUNTA(Shift_Codes),1,MATCH(M9,Shift_Codes,0)+1))))","v":""},{"$f":"IF(OR($C9=\"\",O$7=\"\"),\"\",IF(N9=\"\",M9,INDEX(Shift_Codes,IF(MATCH(N9,Shift_Codes,0)+1>COUNTA(Shift_Codes),1,MATCH(N9,Shift_Codes,0)+1))))","v":""},{"$f":"IF(OR($C9=\"\",P$7=\"\"),\"\",IF(O9=\"\",N9,INDEX(Shift_Codes,IF(MATCH(O9,Shift_Codes,0)+1>COUNTA(Shift_Codes),1,MATCH(O9,Shift_Codes,0)+1))))","v":""},{"$f":"IF(OR($C9=\"\",Q$7=\"\"),\"\",IF(P9=\"\",O9,INDEX(Shift_Codes,IF(MATCH(P9,Shift_Codes,0)+1>COUNTA(Shift_Codes),1,MATCH(P9,Shift_Codes,0)+1))))","v":""},{"$f":"IF(OR($C9=\"\",R$7=\"\"),\"\",IF(Q9=\"\",P9,INDEX(Shift_Codes,IF(MATCH(Q9,Shift_Codes,0)+1>COUNTA(Shift_Codes),1,MATCH(Q9,Shift_Codes,0)+1))))","v":""},{"$f":"IF(OR($C9=\"\",S$7=\"\"),\"\",IF(R9=\"\",Q9,INDEX(Shift_Codes,IF(MATCH(R9,Shift_Codes,0)+1>COUNTA(Shift_Codes),1,MATCH(R9,Shift_Codes,0)+1))))","v":""},{"$f":"IF(OR($C9=\"\",T$7=\"\"),\"\",IF(S9=\"\",R9,INDEX(Shift_Codes,IF(MATCH(S9,Shift_Codes,0)+1>COUNTA(Shift_Codes),1,MATCH(S9,Shift_Codes,0)+1))))","v":""},{"$f":"IF(OR($C9=\"\",U$7=\"\"),\"\",IF(T9=\"\",S9,INDEX(Shift_Codes,IF(MATCH(T9,Shift_Codes,0)+1>COUNTA(Shift_Codes),1,MATCH(T9,Shift_Codes,0)+1))))","v":""},{"$f":"IF(OR($C9=\"\",V$7=\"\"),\"\",IF(U9=\"\",T9,INDEX(Shift_Codes,IF(MATCH(U9,Shift_Codes,0)+1>COUNTA(Shift_Codes),1,MATCH(U9,Shift_Codes,0)+1))))","v":""},{"$f":"IF(OR($C9=\"\",W$7=\"\"),\"\",IF(V9=\"\",U9,INDEX(Shift_Codes,IF(MATCH(V9,Shift_Codes,0)+1>COUNTA(Shift_Codes),1,MATCH(V9,Shift_Codes,0)+1))))","v":""},{"$f":"IF(OR($C9=\"\",X$7=\"\"),\"\",IF(W9=\"\",V9,INDEX(Shift_Codes,IF(MATCH(W9,Shift_Codes,0)+1>COUNTA(Shift_Codes),1,MATCH(W9,Shift_Codes,0)+1))))","v":""},{"$f":"IF(OR($C9=\"\",Y$7=\"\"),\"\",IF(X9=\"\",W9,INDEX(Shift_Codes,IF(MATCH(X9,Shift_Codes,0)+1>COUNTA(Shift_Codes),1,MATCH(X9,Shift_Codes,0)+1))))","v":""},{"$f":"IF(OR($C9=\"\",Z$7=\"\"),\"\",IF(Y9=\"\",X9,INDEX(Shift_Codes,IF(MATCH(Y9,Shift_Codes,0)+1>COUNTA(Shift_Codes),1,MATCH(Y9,Shift_Codes,0)+1))))","v":""},{"$f":"IF(OR($C9=\"\",AA$7=\"\"),\"\",IF(Z9=\"\",Y9,INDEX(Shift_Codes,IF(MATCH(Z9,Shift_Codes,0)+1>COUNTA(Shift_Codes),1,MATCH(Z9,Shift_Codes,0)+1))))","v":""},{"$f":"IF(OR($C9=\"\",AB$7=\"\"),\"\",IF(AA9=\"\",Z9,INDEX(Shift_Codes,IF(MATCH(AA9,Shift_Codes,0)+1>COUNTA(Shift_Codes),1,MATCH(AA9,Shift_Codes,0)+1))))","v":""},{"$f":"IF(OR($C9=\"\",AC$7=\"\"),\"\",IF(AB9=\"\",AA9,INDEX(Shift_Codes,IF(MATCH(AB9,Shift_Codes,0)+1>COUNTA(Shift_Codes),1,MATCH(AB9,Shift_Codes,0)+1))))","v":""},{"$f":"IF(OR($C9=\"\",AD$7=\"\"),\"\",IF(AC9=\"\",AB9,INDEX(Shift_Codes,IF(MATCH(AC9,Shift_Codes,0)+1>COUNTA(Shift_Codes),1,MATCH(AC9,Shift_Codes,0)+1))))","v":""},{"$f":"IF(OR($C9=\"\",AE$7=\"\"),\"\",IF(AD9=\"\",AC9,INDEX(Shift_Codes,IF(MATCH(AD9,Shift_Codes,0)+1>COUNTA(Shift_Codes),1,MATCH(AD9,Shift_Codes,0)+1))))","v":""},{"$f":"IF(OR($C9=\"\",AF$7=\"\"),\"\",IF(AE9=\"\",AD9,INDEX(Shift_Codes,IF(MATCH(AE9,Shift_Codes,0)+1>COUNTA(Shift_Codes),1,MATCH(AE9,Shift_Codes,0)+1))))","v":""},{"$f":"IF(OR($C9=\"\",AG$7=\"\"),\"\",IF(AF9=\"\",AE9,INDEX(Shift_Codes,IF(MATCH(AF9,Shift_Codes,0)+1>COUNTA(Shift_Codes),1,MATCH(AF9,Shift_Codes,0)+1))))","v":""},{"$f":"IF(OR($C9=\"\",AH$7=\"\"),\"\",IF(AG9=\"\",AF9,INDEX(Shift_Codes,IF(MATCH(AG9,Shift_Codes,0)+1>COUNTA(Shift_Codes),1,MATCH(AG9,Shift_Codes,0)+1))))","v":""},{"$f":"IF(OR($C9=\"\",AI$7=\"\"),\"\",IF(AH9=\"\",AG9,INDEX(Shift_Codes,IF(MATCH(AH9,Shift_Codes,0)+1>COUNTA(Shift_Codes),1,MATCH(AH9,Shift_Codes,0)+1))))","v":""},null,{"$f":"COUNTIF($E9:$AI9,\"D*\")","v":0},{"$f":"COUNTIF($E9:$AI9,\"N*\")","v":0}]
[null,"Terry",null,null,{"$f":"IF(OR($C10=\"\",E$7=\"\"),\"\",IF(D10=\"\",C10,INDEX(Shift_Codes,IF(MATCH(D10,Shift_Codes,0)+1>COUNTA(Shift_Codes),1,MATCH(D10,Shift_Codes,0)+1))))","v":""},{"$f":"IF(OR($C10=\"\",F$7=\"\"),\"\",IF(E10=\"\",D10,INDEX(Shift_Codes,IF(MATCH(E10,Shift_Codes,0)+1>COUNTA(Shift_Codes),1,MATCH(E10,Shift_Codes,0)+1))))","v":""},{"$f":"IF(OR($C10=\"\",G$7=\"\"),\"\",IF(F10=\"\",E10,INDEX(Shift_Codes,IF(MATCH(F10,Shift_Codes,0)+1>COUNTA(Shift_Codes),1,MATCH(F10,Shift_Codes,0)+1))))","v":""},{"$f":"IF(OR($C10=\"\",H$7=\"\"),\"\",IF(G10=\"\",F10,INDEX(Shift_Codes,IF(MATCH(G10,Shift_Codes,0)+1>COUNTA(Shift_Codes),1,MATCH(G10,Shift_Codes,0)+1))))","v":""},{"$f":"IF(OR($C10=\"\",I$7=\"\"),\"\",IF(H10=\"\",G10,INDEX(Shift_Codes,IF(MATCH(H10,Shift_Codes,0)+1>COUNTA(Shift_Codes),1,MATCH(H10,Shift_Codes,0)+1))))","v":""},{"$f":"IF(OR($C10=\"\",J$7=\"\"),\"\",IF(I10=\"\",H10,INDEX(Shift_Codes,IF(MATCH(I10,Shift_Codes,0)+1>COUNTA(Shift_Codes),1,MATCH(I10,Shift_Codes,0)+1))))","v":""},{"$f":"IF(OR($C10=\"\",K$7=\"\"),\"\",IF(J10=\"\",I10,INDEX(Shift_Codes,IF(MATCH(J10,Shift_Codes,0)+1>COUNTA(Shift_Codes),1,MATCH(J10,Shift_Codes,0)+1))))","v":""},{"$f":"IF(OR($C10=\"\",L$7=\"\"),\"\",IF(K10=\"\",J10,INDEX(Shift_Codes,IF(MATCH(K10,Shift_Codes,0)+1>COUNTA(Shift_Codes),1,MATCH(K10,Shift_Codes,0)+1))))","v":""},{"$f":"IF(OR($C10=\"\",M$7=\"\"),\"\",IF(L10=\"\",K10,INDEX(Shift_Codes,IF(MATCH(L10,Shift_Codes,0)+1>COUNTA(Shift_Codes),1,MATCH(L10,Shift_Codes,0)+1))))","v":""},{"$f":"IF(OR($C10=\"\",N$7=\"\"),\"\",IF(M10=\"\",L10,INDEX(Shift_Codes,IF(MATCH(M10,Shift_Codes,0)+1>COUNTA(Shift_Codes),1,MATCH(M10,Shift_Codes,0)+1))))","v":""},{"$f":"IF(OR($C10=\"\",O$7=\"\"),\"\",IF(N10=\"\",M10,INDEX(Shift_Codes,IF(MATCH(N10,Shift_Codes,0)+1>COUNTA(Shift_Codes),1,MATCH(N10,Shift_Codes,0)+1))))","v":""},{"$f":"IF(OR($C10=\"\",P$7=\"\"),\"\",IF(O10=\"\",N10,INDEX(Shift_Codes,IF(MATCH(O10,Shift_Codes,0)+1>COUNTA(Shift_Codes),1,MATCH(O10,Shift_Codes,0)+1))))","v":""},{"$f":"IF(OR($C10=\"\",Q$7=\"\"),\"\",IF(P10=\"\",O10,INDEX(Shift_Codes,IF(MATCH(P10,Shift_Codes,0)+1>COUNTA(Shift_Codes),1,MATCH(P10,Shift_Codes,0)+1))))","v":""},{"$f":"IF(OR($C10=\"\",R$7=\"\"),\"\",IF(Q10=\"\",P10,INDEX(Shift_Codes,IF(MATCH(Q10,Shift_Codes,0)+1>COUNTA(Shift_Codes),1,MATCH(Q10,Shift_Codes,0)+1))))","v":""},{"$f":"IF(OR($C10=\"\",S$7=\"\"),\"\",IF(R10=\"\",Q10,INDEX(Shift_Codes,IF(MATCH(R10,Shift_Codes,0)+1>COUNTA(Shift_Codes),1,MATCH(R10,Shift_Codes,0)+1))))","v":""},{"$f":"IF(OR($C10=\"\",T$7=\"\"),\"\",IF(S10=\"\",R10,INDEX(Shift_Codes,IF(MATCH(S10,Shift_Codes,0)+1>COUNTA(Shift_Codes),1,MATCH(S10,Shift_Codes,0)+1))))","v":""},{"$f":"IF(OR($C10=\"\",U$7=\"\"),\"\",IF(T10=\"\",S10,INDEX(Shift_Codes,IF(MATCH(T10,Shift_Codes,0)+1>COUNTA(Shift_Codes),1,MATCH(T10,Shift_Codes,0)+1))))","v":""},{"$f":"IF(OR($C10=\"\",V$7=\"\"),\"\",IF(U10=\"\",T10,INDEX(Shift_Codes,IF(MATCH(U10,Shift_Codes,0)+1>COUNTA(Shift_Codes),1,MATCH(U10,Shift_Codes,0)+1))))","v":""},{"$f":"IF(OR($C10=\"\",W$7=\"\"),\"\",IF(V10=\"\",U10,INDEX(Shift_Codes,IF(MATCH(V10,Shift_Codes,0)+1>COUNTA(Shift_Codes),1,MATCH(V10,Shift_Codes,0)+1))))","v":""},{"$f":"IF(OR($C10=\"\",X$7=\"\"),\"\",IF(W10=\"\",V10,INDEX(Shift_Codes,IF(MATCH(W10,Shift_Codes,0)+1>COUNTA(Shift_Codes),1,MATCH(W10,Shift_Codes,0)+1))))","v":""},{"$f":"IF(OR($C10=\"\",Y$7=\"\"),\"\",IF(X10=\"\",W10,INDEX(Shift_Codes,IF(MATCH(X10,Shift_Codes,0)+1>COUNTA(Shift_Codes),1,MATCH(X10,Shift_Codes,0)+1))))","v":""},{"$f":"IF(OR($C10=\"\",Z$7=\"\"),\"\",IF(Y10=\"\",X10,INDEX(Shift_Codes,IF(MATCH(Y10,Shift_Codes,0)+1>COUNTA(Shift_Codes),1,MATCH(Y10,Shift_Codes,0)+1))))","v":""},{"$f":"IF(OR($C10=\"\",AA$7=\"\"),\"\",IF(Z10=\"\",Y10,INDEX(Shift_Codes,IF(MATCH(Z10,Shift_Codes,0)+1>COUNTA(Shift_Codes),1,MATCH(Z10,Shift_Codes,0)+1))))","v":""},{"$f":"IF(OR($C10=\"\",AB$7=\"\"),\"\",IF(AA10=\"\",Z10,INDEX(Shift_Codes,IF(MATCH(AA10,Shift_Codes,0)+1>COUNTA(Shift_Codes),1,MATCH(AA10,Shift_Codes,0)+1))))","v":""},{"$f":"IF(OR($C10=\"\",AC$7=\"\"),\"\",IF(AB10=\"\",AA10,INDEX(Shift_Codes,IF(MATCH(AB10,Shift_Codes,0)+1>COUNTA(Shift_Codes),1,MATCH(AB10,Shift_Codes,0)+1))))","v":""},{"$f":"IF(OR($C10=\"\",AD$7=\"\"),\"\",IF(AC10=\"\",AB10,INDEX(Shift_Codes,IF(MATCH(AC10,Shift_Codes,0)+1>COUNTA(Shift_Codes),1,MATCH(AC10,Shift_Codes,0)+1))))","v":""},{"$f":"IF(OR($C10=\"\",AE$7=\"\"),\"\",IF(AD10=\"\",AC10,INDEX(Shift_Codes,IF(MATCH(AD10,Shift_Codes,0)+1>COUNTA(Shift_Codes),1,MATCH(AD10,Shift_Codes,0)+1))))","v":""},{"$f":"IF(OR($C10=\"\",AF$7=\"\"),\"\",IF(AE10=\"\",AD10,INDEX(Shift_Codes,IF(MATCH(AE10,Shift_Codes,0)+1>COUNTA(Shift_Codes),1,MATCH(AE10,Shift_Codes,0)+1))))","v":""},{"$f":"IF(OR($C10=\"\",AG$7=\"\"),\"\",IF(AF10=\"\",AE10,INDEX(Shift_Codes,IF(MATCH(AF10,Shift_Codes,0)+1>COUNTA(Shift_Codes),1,MATCH(AF10,Shift_Codes,0)+1))))","v":""},{"$f":"IF(OR($C10=\"\",AH$7=\"\"),\"\",IF(AG10=\"\",AF10,INDEX(Shift_Codes,IF(MATCH(AG10,Shift_Codes,0)+1>COUNTA(Shift_Codes),1,MATCH(AG10,Shift_Codes,0)+1))))","v":""},{"$f":"IF(OR($C10=\"\",AI$7=\"\"),\"\",IF(AH10=\"\",AG10,INDEX(Shift_Codes,IF(MATCH(AH10,Shift_Codes,0)+1>COUNTA(Shift_Codes),1,MATCH(AH10,Shift_Codes,0)+1))))","v":""},null,0,0]
[null,null,null,null,{"$f":"IF(OR($C11=\"\",E$7=\"\"),\"\",IF(D11=\"\",C11,INDEX(Shift_Codes,IF(MATCH(D11,Shift_Codes,0)+1>COUNTA(Shift_Codes),1,MATCH(D11,Shift_Codes,0)+1))))","v":""},{"$f":"IF(OR($C11=\"\",F$7=\"\"),\"\",IF(E11=\"\",D11,INDEX(Shift_Codes,IF(MATCH(E11,Shift_Codes,0)+1>COUNTA(Shift_Codes),1,MATCH(E11,Shift_Codes,0)+1))))","v":""},{"$f":"IF(OR($C11=\"\",G$7=\"\"),\"\",IF(F11=\"\",E11,INDEX(Shift_Codes,IF(MATCH(F11,Shift_Codes,0)+1>COUNTA(Shift_Codes),1,MATCH(F11,Shift_Codes,0)+1))))","v":""},{"$f":"IF(OR($C11=\"\",H$7=\"\"),\"\",IF(G11=\"\",F11,INDEX(Shift_Codes,IF(MATCH(G11,Shift_Codes,0)+1>COUNTA(Shift_Codes),1,MATCH(G11,Shift_Codes,0)+1))))","v":""},{"$f":"IF(OR($C11=\"\",I$7=\"\"),\"\",IF(H11=\"\",G11,INDEX(Shift_Codes,IF(MATCH(H11,Shift_Codes,0)+1>COUNTA(Shift_Codes),1,MATCH(H11,Shift_Codes,0)+1))))","v":""},{"$f":"IF(OR($C11=\"\",J$7=\"\"),\"\",IF(I11=\"\",H11,INDEX(Shift_Codes,IF(MATCH(I11,Shift_Codes,0)+1>COUNTA(Shift_Codes),1,MATCH(I11,Shift_Codes,0)+1))))","v":""},{"$f":"IF(OR($C11=\"\",K$7=\"\"),\"\",IF(J11=\"\",I11,INDEX(Shift_Codes,IF(MATCH(J11,Shift_Codes,0)+1>COUNTA(Shift_Codes),1,MATCH(J11,Shift_Codes,0)+1))))","v":""},{"$f":"IF(OR($C11=\"\",L$7=\"\"),\"\",IF(K11=\"\",J11,INDEX(Shift_Codes,IF(MATCH(K11,Shift_Codes,0)+1>COUNTA(Shift_Codes),1,MATCH(K11,Shift_Codes,0)+1))))","v":""},{"$f":"IF(OR($C11=\"\",M$7=\"\"),\"\",IF(L11=\"\",K11,INDEX(Shift_Codes,IF(MATCH(L11,Shift_Codes,0)+1>COUNTA(Shift_Codes),1,MATCH(L11,Shift_Codes,0)+1))))","v":""},{"$f":"IF(OR($C11=\"\",N$7=\"\"),\"\",IF(M11=\"\",L11,INDEX(Shift_Codes,IF(MATCH(M11,Shift_Codes,0)+1>COUNTA(Shift_Codes),1,MATCH(M11,Shift_Codes,0)+1))))","v":""},{"$f":"IF(OR($C11=\"\",O$7=\"\"),\"\",IF(N11=\"\",M11,INDEX(Shift_Codes,IF(MATCH(N11,Shift_Codes,0)+1>COUNTA(Shift_Codes),1,MATCH(N11,Shift_Codes,0)+1))))","v":""},{"$f":"IF(OR($C11=\"\",P$7=\"\"),\"\",IF(O11=\"\",N11,INDEX(Shift_Codes,IF(MATCH(O11,Shift_Codes,0)+1>COUNTA(Shift_Codes),1,MATCH(O11,Shift_Codes,0)+1))))","v":""},{"$f":"IF(OR($C11=\"\",Q$7=\"\"),\"\",IF(P11=\"\",O11,INDEX(Shift_Codes,IF(MATCH(P11,Shift_Codes,0)+1>COUNTA(Shift_Codes),1,MATCH(P11,Shift_Codes,0)+1))))","v":""},{"$f":"IF(OR($C11=\"\",R$7=\"\"),\"\",IF(Q11=\"\",P11,INDEX(Shift_Codes,IF(MATCH(Q11,Shift_Codes,0)+1>COUNTA(Shift_Codes),1,MATCH(Q11,Shift_Codes,0)+1))))","v":""},{"$f":"IF(OR($C11=\"\",S$7=\"\"),\"\",IF(R11=\"\",Q11,INDEX(Shift_Codes,IF(MATCH(R11,Shift_Codes,0)+1>COUNTA(Shift_Codes),1,MATCH(R11,Shift_Codes,0)+1))))","v":""},{"$f":"IF(OR($C11=\"\",T$7=\"\"),\"\",IF(S11=\"\",R11,INDEX(Shift_Codes,IF(MATCH(S11,Shift_Codes,0)+1>COUNTA(Shift_Codes),1,MATCH(S11,Shift_Codes,0)+1))))","v":""},{"$f":"IF(OR($C11=\"\",U$7=\"\"),\"\",IF(T11=\"\",S11,INDEX(Shift_Codes,IF(MATCH(T11,Shift_Codes,0)+1>COUNTA(Shift_Codes),1,MATCH(T11,Shift_Codes,0)+1))))","v":""},{"$f":"IF(OR($C11=\"\",V$7=\"\"),\"\",IF(U11=\"\",T11,INDEX(Shift_Codes,IF(MATCH(U11,Shift_Codes,0)+1>COUNTA(Shift_Codes),1,MATCH(U11,Shift_Codes,0)+1))))","v":""},{"$f":"IF(OR($C11=\"\",W$7=\"\"),\"\",IF(V11=\"\",U11,INDEX(Shift_Codes,IF(MATCH(V11,Shift_Codes,0)+1>COUNTA(Shift_Codes),1,MATCH(V11,Shift_Codes,0)+1))))","v":""},{"$f":"IF(OR($C11=\"\",X$7=\"\"),\"\",IF(W11=\"\",V11,INDEX(Shift_Codes,IF(MATCH(W11,Shift_Codes,0)+1>COUNTA(Shift_Codes),1,MATCH(W11,Shift_Codes,0)+1))))","v":""},{"$f":"IF(OR($C11=\"\",Y$7=\"\"),\"\",IF(X11=\"\",W11,INDEX(Shift_Codes,IF(MATCH(X11,Shift_Codes,0)+1>COUNTA(Shift_Codes),1,MATCH(X11,Shift_Codes,0)+1))))","v":""},{"$f":"IF(OR($C11=\"\",Z$7=\"\"),\"\",IF(Y11=\"\",X11,INDEX(Shift_Codes,IF(MATCH(Y11,Shift_Codes,0)+1>COUNTA(Shift_Codes),1,MATCH(Y11,Shift_Codes,0)+1))))","v":""},{"$f":"IF(OR($C11=\"\",AA$7=\"\"),\"\",IF(Z11=\"\",Y11,INDEX(Shift_Codes,IF(MATCH(Z11,Shift_Codes,0)+1>COUNTA(Shift_Codes),1,MATCH(Z11,Shift_Codes,0)+1))))","v":""},{"$f":"IF(OR($C11=\"\",AB$7=\"\"),\"\",IF(AA11=\"\",Z11,INDEX(Shift_Codes,IF(MATCH(AA11,Shift_Codes,0)+1>COUNTA(Shift_Codes),1,MATCH(AA11,Shift_Codes,0)+1))))","v":""},{"$f":"IF(OR($C11=\"\",AC$7=\"\"),\"\",IF(AB11=\"\",AA11,INDEX(Shift_Codes,IF(MATCH(AB11,Shift_Codes,0)+1>COUNTA(Shift_Codes),1,MATCH(AB11,Shift_Codes,0)+1))))","v":""},{"$f":"IF(OR($C11=\"\",AD$7=\"\"),\"\",IF(AC11=\"\",AB11,INDEX(Shift_Codes,IF(MATCH(AC11,Shift_Codes,0)+1>COUNTA(Shift_Codes),1,MATCH(AC11,Shift_Codes,0)+1))))","v":""},{"$f":"IF(OR($C11=\"\",AE$7=\"\"),\"\",IF(AD11=\"\",AC11,INDEX(Shift_Codes,IF(MATCH(AD11,Shift_Codes,0)+1>COUNTA(Shift_Codes),1,MATCH(AD11,Shift_Codes,0)+1))))","v":""},{"$f":"IF(OR($C11=\"\",AF$7=\"\"),\"\",IF(AE11=\"\",AD11,INDEX(Shift_Codes,IF(MATCH(AE11,Shift_Codes,0)+1>COUNTA(Shift_Codes),1,MATCH(AE11,Shift_Codes,0)+1))))","v":""},{"$f":"IF(OR($C11=\"\",AG$7=\"\"),\"\",IF(AF11=\"\",AE11,INDEX(Shift_Codes,IF(MATCH(AF11,Shift_Codes,0)+1>COUNTA(Shift_Codes),1,MATCH(AF11,Shift_Codes,0)+1))))","v":""},{"$f":"IF(OR($C11=\"\",AH$7=\"\"),\"\",IF(AG11=\"\",AF11,INDEX(Shift_Codes,IF(MATCH(AG11,Shift_Codes,0)+1>COUNTA(Shift_Codes),1,MATCH(AG11,Shift_Codes,0)+1))))","v":""},{"$f":"IF(OR($C11=\"\",AI$7=\"\"),\"\",IF(AH11=\"\",AG11,INDEX(Shift_Codes,IF(MATCH(AH11,Shift_Codes,0)+1>COUNTA(Shift_Codes),1,MATCH(AH11,Shift_Codes,0)+1))))","v":""},null,0,0]
[null,null,null,null,{"$f":"IF(OR($C12=\"\",E$7=\"\"),\"\",IF(D12=\"\",C12,INDEX(Shift_Codes,IF(MATCH(D12,Shift_Codes,0)+1>COUNTA(Shift_Codes),1,MATCH(D12,Shift_Codes,0)+1))))","v":""},{"$f":"IF(OR($C12=\"\",F$7=\"\"),\"\",IF(E12=\"\",D12,INDEX(Shift_Codes,IF(MATCH(E12,Shift_Codes,0)+1>COUNTA(Shift_Codes),1,MATCH(E12,Shift_Codes,0)+1))))","v":""},{"$f":"IF(OR($C12=\"\",G$7=\"\"),\"\",IF(F12=\"\",E12,INDEX(Shift_Codes,IF(MATCH(F12,Shift_Codes,0)+1>COUNTA(Shift_Codes),1,MATCH(F12,Shift_Codes,0)+1))))","v":""},{"$f":"IF(OR($C12=\"\",H$7=\"\"),\"\",IF(G12=\"\",F12,INDEX(Shift_Codes,IF(MATCH(G12,Shift_Codes,0)+1>COUNTA(Shift_Codes),1,MATCH(G12,Shift_Codes,0)+1))))","v":""},{"$f":"IF(OR($C12=\"\",I$7=\"\"),\"\",IF(H12=\"\",G12,INDEX(Shift_Codes,IF(MATCH(H12,Shift_Codes,0)+1>COUNTA(Shift_Codes),1,MATCH(H12,Shift_Codes,0)+1))))","v":""},{"$f":"IF(OR($C12=\"\",J$7=\"\"),\"\",IF(I12=\"\",H12,INDEX(Shift_Codes,IF(MATCH(I12,Shift_Codes,0)+1>COUNTA(Shift_Codes),1,MATCH(I12,Shift_Codes,0)+1))))","v":""},{"$f":"IF(OR($C12=\"\",K$7=\"\"),\"\",IF(J12=\"\",I12,INDEX(Shift_Codes,IF(MATCH(J12,Shift_Codes,0)+1>COUNTA(Shift_Codes),1,MATCH(J12,Shift_Codes,0)+1))))","v":""},{"$f":"IF(OR($C12=\"\",L$7=\"\"),\"\",IF(K12=\"\",J12,INDEX(Shift_Codes,IF(MATCH(K12,Shift_Codes,0)+1>COUNTA(Shift_Codes),1,MATCH(K12,Shift_Codes,0)+1))))","v":""},{"$f":"IF(OR($C12=\"\",M$7=\"\"),\"\",IF(L12=\"\",K12,INDEX(Shift_Codes,IF(MATCH(L12,Shift_Codes,0)+1>COUNTA(Shift_Codes),1,MATCH(L12,Shift_Codes,0)+1))))","v":""},{"$f":"IF(OR($C12=\"\",N$7=\"\"),\"\",IF(M12=\"\",L12,INDEX(Shift_Codes,IF(MATCH(M12,Shift_Codes,0)+1>COUNTA(Shift_Codes),1,MATCH(M12,Shift_Codes,0)+1))))","v":""},{"$f":"IF(OR($C12=\"\",O$7=\"\"),\"\",IF(N12=\"\",M12,INDEX(Shift_Codes,IF(MATCH(N12,Shift_Codes,0)+1>COUNTA(Shift_Codes),1,MATCH(N12,Shift_Codes,0)+1))))","v":""},{"$f":"IF(OR($C12=\"\",P$7=\"\"),\"\",IF(O12=\"\",N12,INDEX(Shift_Codes,IF(MATCH(O12,Shift_Codes,0)+1>COUNTA(Shift_Codes),1,MATCH(O12,Shift_Codes,0)+1))))","v":""},{"$f":"IF(OR($C12=\"\",Q$7=\"\"),\"\",IF(P12=\"\",O12,INDEX(Shift_Codes,IF(MATCH(P12,Shift_Codes,0)+1>COUNTA(Shift_Codes),1,MATCH(P12,Shift_Codes,0)+1))))","v":""},{"$f":"IF(OR($C12=\"\",R$7=\"\"),\"\",IF(Q12=\"\",P12,INDEX(Shift_Codes,IF(MATCH(Q12,Shift_Codes,0)+1>COUNTA(Shift_Codes),1,MATCH(Q12,Shift_Codes,0)+1))))","v":""},{"$f":"IF(OR($C12=\"\",S$7=\"\"),\"\",IF(R12=\"\",Q12,INDEX(Shift_Codes,IF(MATCH(R12,Shift_Codes,0)+1>COUNTA(Shift_Codes),1,MATCH(R12,Shift_Codes,0)+1))))","v":""},{"$f":"IF(OR($C12=\"\",T$7=\"\"),\"\",IF(S12=\"\",R12,INDEX(Shift_Codes,IF(MATCH(S12,Shift_Codes,0)+1>COUNTA(Shift_Codes),1,MATCH(S12,Shift_Codes,0)+1))))","v":""},{"$f":"IF(OR($C12=\"\",U$7=\"\"),\"\",IF(T12=\"\",S12,INDEX(Shift_Codes,IF(MATCH(T12,Shift_Codes,0)+1>COUNTA(Shift_Codes),1,MATCH(T12,Shift_Codes,0)+1))))","v":""},{"$f":"IF(OR($C12=\"\",V$7=\"\"),\"\",IF(U12=\"\",T12,INDEX(Shift_Codes,IF(MATCH(U12,Shift_Codes,0)+1>COUNTA(Shift_Codes),1,MATCH(U12,Shift_Codes,0)+1))))","v":""},{"$f":"IF(OR($C12=\"\",W$7=\"\"),\"\",IF(V12=\"\",U12,INDEX(Shift_Codes,IF(MATCH(V12,Shift_Codes,0)+1>COUNTA(Shift_Codes),1,MATCH(V12,Shift_Codes,0)+1))))","v":""},{"$f":"IF(OR($C12=\"\",X$7=\"\"),\"\",IF(W12=\"\",V12,INDEX(Shift_Codes,IF(MATCH(W12,Shift_Codes,0)+1>COUNTA(Shift_Codes),1,MATCH(W12,Shift_Codes,0)+1))))","v":""},{"$f":"IF(OR($C12=\"\",Y$7=\"\"),\"\",IF(X12=\"\",W12,INDEX(Shift_Codes,IF(MATCH(X12,Shift_Codes,0)+1>COUNTA(Shift_Codes),1,MATCH(X12,Shift_Codes,0)+1))))","v":""},{"$f":"IF(OR($C12=\"\",Z$7=\"\"),\"\",IF(Y12=\"\",X12,INDEX(Shift_Codes,IF(MATCH(Y12,Shift_Codes,0)+1>COUNTA(Shift_Codes),1,MATCH(Y12,Shift_Codes,0)+1))))","v":""},{"$f":"IF(OR($C12=\"\",AA$7=\"\"),\"\",IF(Z12=\"\",Y12,INDEX(Shift_Codes,IF(MATCH(Z12,Shift_Codes,0)+1>COUNTA(Shift_Codes),1,MATCH(Z12,Shift_Codes,0)+1))))","v":""},{"$f":"IF(OR($C12=\"\",AB$7=\"\"),\"\",IF(AA12=\"\",Z12,INDEX(Shift_Codes,IF(MATCH(AA12,Shift_Codes,0)+1>COUNTA(Shift_Codes),1,MATCH(AA12,Shift_Codes,0)+1))))","v":""},{"$f":"IF(OR($C12=\"\",AC$7=\"\"),\"\",IF(AB12=\"\",AA12,INDEX(Shift_Codes,IF(MATCH(AB12,Shift_Codes,0)+1>COUNTA(Shift_Codes),1,MATCH(AB12,Shift_Codes,0)+1))))","v":""},{"$f":"IF(OR($C12=\"\",AD$7=\"\"),\"\",IF(AC12=\"\",AB12,INDEX(Shift_Codes,IF(MATCH(AC12,Shift_Codes,0)+1>COUNTA(Shift_Codes),1,MATCH(AC12,Shift_Codes,0)+1))))","v":""},{"$f":"IF(OR($C12=\"\",AE$7=\"\"),\"\",IF(AD12=\"\",AC12,INDEX(Shift_Codes,IF(MATCH(AD12,Shift_Codes,0)+1>COUNTA(Shift_Codes),1,MATCH(AD12,Shift_Codes,0)+1))))","v":""},{"$f":"IF(OR($C12=\"\",AF$7=\"\"),\"\",IF(AE12=\"\",AD12,INDEX(Shift_Codes,IF(MATCH(AE12,Shift_Codes,0)+1>COUNTA(Shift_Codes),1,MATCH(AE12,Shift_Codes,0)+1))))","v":""},{"$f":"IF(OR($C12=\"\",AG$7=\"\"),\"\",IF(AF12=\"\",AE12,INDEX(Shift_Codes,IF(MATCH(AF12,Shift_Codes,0)+1>COUNTA(Shift_Codes),1,MATCH(AF12,Shift_Codes,0)+1))))","v":""},{"$f":"IF(OR($C12=\"\",AH$7=\"\"),\"\",IF(AG12=\"\",AF12,INDEX(Shift_Codes,IF(MATCH(AG12,Shift_Codes,0)+1>COUNTA(Shift_Codes),1,MATCH(AG12,Shift_Codes,0)+1))))","v":""},{"$f":"IF(OR($C12=\"\",AI$7=\"\"),\"\",IF(AH12=\"\",AG12,INDEX(Shift_Codes,IF(MATCH(AH12,Shift_Codes,0)+1>COUNTA(Shift_Codes),1,MATCH(AH12,Shift_Codes,0)+1))))","v":""},null,0,0]
[null,null,null,null,{"$f":"IF(OR($C13=\"\",E$7=\"\"),\"\",IF(D13=\"\",C13,INDEX(Shift_Codes,IF(MATCH(D13,Shift_Codes,0)+1>COUNTA(Shift_Codes),1,MATCH(D13,Shift_Codes,0)+1))))","v":""},{"$f":"IF(OR($C13=\"\",F$7=\"\"),\"\",IF(E13=\"\",D13,INDEX(Shift_Codes,IF(MATCH(E13,Shift_Codes,0)+1>COUNTA(Shift_Codes),1,MATCH(E13,Shift_Codes,0)+1))))","v":""},{"$f":"IF(OR($C13=\"\",G$7=\"\"),\"\",IF(F13=\"\",E13,INDEX(Shift_Codes,IF(MATCH(F13,Shift_Codes,0)+1>COUNTA(Shift_Codes),1,MATCH(F13,Shift_Codes,0)+1))))","v":""},{"$f":"IF(OR($C13=\"\",H$7=\"\"),\"\",IF(G13=\"\",F13,INDEX(Shift_Codes,IF(MATCH(G13,Shift_Codes,0)+1>COUNTA(Shift_Codes),1,MATCH(G13,Shift_Codes,0)+1))))","v":""},{"$f":"IF(OR($C13=\"\",I$7=\"\"),\"\",IF(H13=\"\",G13,INDEX(Shift_Codes,IF(MATCH(H13,Shift_Codes,0)+1>COUNTA(Shift_Codes),1,MATCH(H13,Shift_Codes,0)+1))))","v":""},{"$f":"IF(OR($C13=\"\",J$7=\"\"),\"\",IF(I13=\"\",H13,INDEX(Shift_Codes,IF(MATCH(I13,Shift_Codes,0)+1>COUNTA(Shift_Codes),1,MATCH(I13,Shift_Codes,0)+1))))","v":""},{"$f":"IF(OR($C13=\"\",K$7=\"\"),\"\",IF(J13=\"\",I13,INDEX(Shift_Codes,IF(MATCH(J13,Shift_Codes,0)+1>COUNTA(Shift_Codes),1,MATCH(J13,Shift_Codes,0)+1))))","v":""},{"$f":"IF(OR($C13=\"\",L$7=\"\"),\"\",IF(K13=\"\",J13,INDEX(Shift_Codes,IF(MATCH(K13,Shift_Codes,0)+1>COUNTA(Shift_Codes),1,MATCH(K13,Shift_Codes,0)+1))))","v":""},{"$f":"IF(OR($C13=\"\",M$7=\"\"),\"\",IF(L13=\"\",K13,INDEX(Shift_Codes,IF(MATCH(L13,Shift_Codes,0)+1>COUNTA(Shift_Codes),1,MATCH(L13,Shift_Codes,0)+1))))","v":""},{"$f":"IF(OR($C13=\"\",N$7=\"\"),\"\",IF(M13=\"\",L13,INDEX(Shift_Codes,IF(MATCH(M13,Shift_Codes,0)+1>COUNTA(Shift_Codes),1,MATCH(M13,Shift_Codes,0)+1))))","v":""},{"$f":"IF(OR($C13=\"\",O$7=\"\"),\"\",IF(N13=\"\",M13,INDEX(Shift_Codes,IF(MATCH(N13,Shift_Codes,0)+1>COUNTA(Shift_Codes),1,MATCH(N13,Shift_Codes,0)+1))))","v":""},{"$f":"IF(OR($C13=\"\",P$7=\"\"),\"\",IF(O13=\"\",N13,INDEX(Shift_Codes,IF(MATCH(O13,Shift_Codes,0)+1>COUNTA(Shift_Codes),1,MATCH(O13,Shift_Codes,0)+1))))","v":""},{"$f":"IF(OR($C13=\"\",Q$7=\"\"),\"\",IF(P13=\"\",O13,INDEX(Shift_Codes,IF(MATCH(P13,Shift_Codes,0)+1>COUNTA(Shift_Codes),1,MATCH(P13,Shift_Codes,0)+1))))","v":""},{"$f":"IF(OR($C13=\"\",R$7=\"\"),\"\",IF(Q13=\"\",P13,INDEX(Shift_Codes,IF(MATCH(Q13,Shift_Codes,0)+1>COUNTA(Shift_Codes),1,MATCH(Q13,Shift_Codes,0)+1))))","v":""},{"$f":"IF(OR($C13=\"\",S$7=\"\"),\"\",IF(R13=\"\",Q13,INDEX(Shift_Codes,IF(MATCH(R13,Shift_Codes,0)+1>COUNTA(Shift_Codes),1,MATCH(R13,Shift_Codes,0)+1))))","v":""},{"$f":"IF(OR($C13=\"\",T$7=\"\"),\"\",IF(S13=\"\",R13,INDEX(Shift_Codes,IF(MATCH(S13,Shift_Codes,0)+1>COUNTA(Shift_Codes),1,MATCH(S13,Shift_Codes,0)+1))))","v":""},{"$f":"IF(OR($C13=\"\",U$7=\"\"),\"\",IF(T13=\"\",S13,INDEX(Shift_Codes,IF(MATCH(T13,Shift_Codes,0)+1>COUNTA(Shift_Codes),1,MATCH(T13,Shift_Codes,0)+1))))","v":""},{"$f":"IF(OR($C13=\"\",V$7=\"\"),\"\",IF(U13=\"\",T13,INDEX(Shift_Codes,IF(MATCH(U13,Shift_Codes,0)+1>COUNTA(Shift_Codes),1,MATCH(U13,Shift_Codes,0)+1))))","v":""},{"$f":"IF(OR($C13=\"\",W$7=\"\"),\"\",IF(V13=\"\",U13,INDEX(Shift_Codes,IF(MATCH(V13,Shift_Codes,0)+1>COUNTA(Shift_Codes),1,MATCH(V13,Shift_Codes,0)+1))))","v":""},{"$f":"IF(OR($C13=\"\",X$7=\"\"),\"\",IF(W13=\"\",V13,INDEX(Shift_Codes,IF(MATCH(W13,Shift_Codes,0)+1>COUNTA(Shift_Codes),1,MATCH(W13,Shift_Codes,0)+1))))","v":""},{"$f":"IF(OR($C13=\"\",Y$7=\"\"),\"\",IF(X13=\"\",W13,INDEX(Shift_Codes,IF(MATCH(X13,Shift_Codes,0)+1>COUNTA(Shift_Codes),1,MATCH(X13,Shift_Codes,0)+1))))","v":""},{"$f":"IF(OR($C13=\"\",Z$7=\"\"),\"\",IF(Y13=\"\",X13,INDEX(Shift_Codes,IF(MATCH(Y13,Shift_Codes,0)+1>COUNTA(Shift_Codes),1,MATCH(Y13,Shift_Codes,0)+1))))","v":""},{"$f":"IF(OR($C13=\"\",AA$7=\"\"),\"\",IF(Z13=\"\",Y13,INDEX(Shift_Codes,IF(MATCH(Z13,Shift_Codes,0)+1>COUNTA(Shift_Codes),1,MATCH(Z13,Shift_Codes,0)+1))))","v":""},{"$f":"IF(OR($C13=\"\",AB$7=\"\"),\"\",IF(AA13=\"\",Z13,INDEX(Shift_Codes,IF(MATCH(AA13,Shift_Codes,0)+1>COUNTA(Shift_Codes),1,MATCH(AA13,Shift_Codes,0)+1))))","v":""},{"$f":"IF(OR($C13=\"\",AC$7=\"\"),\"\",IF(AB13=\"\",AA13,INDEX(Shift_Codes,IF(MATCH(AB13,Shift_Codes,0)+1>COUNTA(Shift_Codes),1,MATCH(AB13,Shift_Codes,0)+1))))","v":""},{"$f":"IF(OR($C13=\"\",AD$7=\"\"),\"\",IF(AC13=\"\",AB13,INDEX(Shift_Codes,IF(MATCH(AC13,Shift_Codes,0)+1>COUNTA(Shift_Codes),1,MATCH(AC13,Shift_Codes,0)+1))))","v":""},{"$f":"IF(OR($C13=\"\",AE$7=\"\"),\"\",IF(AD13=\"\",AC13,INDEX(Shift_Codes,IF(MATCH(AD13,Shift_Codes,0)+1>COUNTA(Shift_Codes),1,MATCH(AD13,Shift_Codes,0)+1))))","v":""},{"$f":"IF(OR($C13=\"\",AF$7=\"\"),\"\",IF(AE13=\"\",AD13,INDEX(Shift_Codes,IF(MATCH(AE13,Shift_Codes,0)+1>COUNTA(Shift_Codes),1,MATCH(AE13,Shift_Codes,0)+1))))","v":""},{"$f":"IF(OR($C13=\"\",AG$7=\"\"),\"\",IF(AF13=\"\",AE13,INDEX(Shift_Codes,IF(MATCH(AF13,Shift_Codes,0)+1>COUNTA(Shift_Codes),1,MATCH(AF13,Shift_Codes,0)+1))))","v":""},{"$f":"IF(OR($C13=\"\",AH$7=\"\"),\"\",IF(AG13=\"\",AF13,INDEX(Shift_Codes,IF(MATCH(AG13,Shift_Codes,0)+1>COUNTA(Shift_Codes),1,MATCH(AG13,Shift_Codes,0)+1))))","v":""},{"$f":"IF(OR($C13=\"\",AI$7=\"\"),\"\",IF(AH13=\"\",AG13,INDEX(Shift_Codes,IF(MATCH(AH13,Shift_Codes,0)+1>COUNTA(Shift_Codes),1,MATCH(AH13,Shift_Codes,0)+1))))","v":""},null,0,0]
[null,null,null,null,{"$f":"IF(OR($C14=\"\",E$7=\"\"),\"\",IF(D14=\"\",C14,INDEX(Shift_Codes,IF(MATCH(D14,Shift_Codes,0)+1>COUNTA(Shift_Codes),1,MATCH(D14,Shift_Codes,0)+1))))","v":""},{"$f":"IF(OR($C14=\"\",F$7=\"\"),\"\",IF(E14=\"\",D14,INDEX(Shift_Codes,IF(MATCH(E14,Shift_Codes,0)+1>COUNTA(Shift_Codes),1,MATCH(E14,Shift_Codes,0)+1))))","v":""},{"$f":"IF(OR($C14=\"\",G$7=\"\"),\"\",IF(F14=\"\",E14,INDEX(Shift_Codes,IF(MATCH(F14,Shift_Codes,0)+1>COUNTA(Shift_Codes),1,MATCH(F14,Shift_Codes,0)+1))))","v":""},{"$f":"IF(OR($C14=\"\",H$7=\"\"),\"\",IF(G14=\"\",F14,INDEX(Shift_Codes,IF(MATCH(G14,Shift_Codes,0)+1>COUNTA(Shift_Codes),1,MATCH(G14,Shift_Codes,0)+1))))","v":""},{"$f":"IF(OR($C14=\"\",I$7=\"\"),\"\",IF(H14=\"\",G14,INDEX(Shift_Codes,IF(MATCH(H14,Shift_Codes,0)+1>COUNTA(Shift_Codes),1,MATCH(H14,Shift_Codes,0)+1))))","v":""},{"$f":"IF(OR($C14=\"\",J$7=\"\"),\"\",IF(I14=\"\",H14,INDEX(Shift_Codes,IF(MATCH(I14,Shift_Codes,0)+1>COUNTA(Shift_Codes),1,MATCH(I14,Shift_Codes,0)+1))))","v":""},{"$f":"IF(OR($C14=\"\",K$7=\"\"),\"\",IF(J14=\"\",I14,INDEX(Shift_Codes,IF(MATCH(J14,Shift_Codes,0)+1>COUNTA(Shift_Codes),1,MATCH(J14,Shift_Codes,0)+1))))","v":""},{"$f":"IF(OR($C14=\"\",L$7=\"\"),\"\",IF(K14=\"\",J14,INDEX(Shift_Codes,IF(MATCH(K14,Shift_Codes,0)+1>COUNTA(Shift_Codes),1,MATCH(K14,Shift_Codes,0)+1))))","v":""},{"$f":"IF(OR($C14=\"\",M$7=\"\"),\"\",IF(L14=\"\",K14,INDEX(Shift_Codes,IF(MATCH(L14,Shift_Codes,0)+1>COUNTA(Shift_Codes),1,MATCH(L14,Shift_Codes,0)+1))))","v":""},{"$f":"IF(OR($C14=\"\",N$7=\"\"),\"\",IF(M14=\"\",L14,INDEX(Shift_Codes,IF(MATCH(M14,Shift_Codes,0)+1>COUNTA(Shift_Codes),1,MATCH(M14,Shift_Codes,0)+1))))","v":""},{"$f":"IF(OR($C14=\"\",O$7=\"\"),\"\",IF(N14=\"\",M14,INDEX(Shift_Codes,IF(MATCH(N14,Shift_Codes,0)+1>COUNTA(Shift_Codes),1,MATCH(N14,Shift_Codes,0)+1))))","v":""},{"$f":"IF(OR($C14=\"\",P$7=\"\"),\"\",IF(O14=\"\",N14,INDEX(Shift_Codes,IF(MATCH(O14,Shift_Codes,0)+1>COUNTA(Shift_Codes),1,MATCH(O14,Shift_Codes,0)+1))))","v":""},{"$f":"IF(OR($C14=\"\",Q$7=\"\"),\"\",IF(P14=\"\",O14,INDEX(Shift_Codes,IF(MATCH(P14,Shift_Codes,0)+1>COUNTA(Shift_Codes),1,MATCH(P14,Shift_Codes,0)+1))))","v":""},{"$f":"IF(OR($C14=\"\",R$7=\"\"),\"\",IF(Q14=\"\",P14,INDEX(Shift_Codes,IF(MATCH(Q14,Shift_Codes,0)+1>COUNTA(Shift_Codes),1,MATCH(Q14,Shift_Codes,0)+1))))","v":""},{"$f":"IF(OR($C14=\"\",S$7=\"\"),\"\",IF(R14=\"\",Q14,INDEX(Shift_Codes,IF(MATCH(R14,Shift_Codes,0)+1>COUNTA(Shift_Codes),1,MATCH(R14,Shift_Codes,0)+1))))","v":""},{"$f":"IF(OR($C14=\"\",T$7=\"\"),\"\",IF(S14=\"\",R14,INDEX(Shift_Codes,IF(MATCH(S14,Shift_Codes,0)+1>COUNTA(Shift_Codes),1,MATCH(S14,Shift_Codes,0)+1))))","v":""},{"$f":"IF(OR($C14=\"\",U$7=\"\"),\"\",IF(T14=\"\",S14,INDEX(Shift_Codes,IF(MATCH(T14,Shift_Codes,0)+1>COUNTA(Shift_Codes),1,MATCH(T14,Shift_Codes,0)+1))))","v":""},{"$f":"IF(OR($C14=\"\",V$7=\"\"),\"\",IF(U14=\"\",T14,INDEX(Shift_Codes,IF(MATCH(U14,Shift_Codes,0)+1>COUNTA(Shift_Codes),1,MATCH(U14,Shift_Codes,0)+1))))","v":""},{"$f":"IF(OR($C14=\"\",W$7=\"\"),\"\",IF(V14=\"\",U14,INDEX(Shift_Codes,IF(MATCH(V14,Shift_Codes,0)+1>COUNTA(Shift_Codes),1,MATCH(V14,Shift_Codes,0)+1))))","v":""},{"$f":"IF(OR($C14=\"\",X$7=\"\"),\"\",IF(W14=\"\",V14,INDEX(Shift_Codes,IF(MATCH(W14,Shift_Codes,0)+1>COUNTA(Shift_Codes),1,MATCH(W14,Shift_Codes,0)+1))))","v":""},{"$f":"IF(OR($C14=\"\",Y$7=\"\"),\"\",IF(X14=\"\",W14,INDEX(Shift_Codes,IF(MATCH(X14,Shift_Codes,0)+1>COUNTA(Shift_Codes),1,MATCH(X14,Shift_Codes,0)+1))))","v":""},{"$f":"IF(OR($C14=\"\",Z$7=\"\"),\"\",IF(Y14=\"\",X14,INDEX(Shift_Codes,IF(MATCH(Y14,Shift_Codes,0)+1>COUNTA(Shift_Codes),1,MATCH(Y14,Shift_Codes,0)+1))))","v":""},{"$f":"IF(OR($C14=\"\",AA$7=\"\"),\"\",IF(Z14=\"\",Y14,INDEX(Shift_Codes,IF(MATCH(Z14,Shift_Codes,0)+1>COUNTA(Shift_Codes),1,MATCH(Z14,Shift_Codes,0)+1))))","v":""},{"$f":"IF(OR($C14=\"\",AB$7=\"\"),\"\",IF(AA14=\"\",Z14,INDEX(Shift_Codes,IF(MATCH(AA14,Shift_Codes,0)+1>COUNTA(Shift_Codes),1,MATCH(AA14,Shift_Codes,0)+1))))","v":""},{"$f":"IF(OR($C14=\"\",AC$7=\"\"),\"\",IF(AB14=\"\",AA14,INDEX(Shift_Codes,IF(MATCH(AB14,Shift_Codes,0)+1>COUNTA(Shift_Codes),1,MATCH(AB14,Shift_Codes,0)+1))))","v":""},{"$f":"IF(OR($C14=\"\",AD$7=\"\"),\"\",IF(AC14=\"\",AB14,INDEX(Shift_Codes,IF(MATCH(AC14,Shift_Codes,0)+1>COUNTA(Shift_Codes),1,MATCH(AC14,Shift_Codes,0)+1))))","v":""},{"$f":"IF(OR($C14=\"\",AE$7=\"\"),\"\",IF(AD14=\"\",AC14,INDEX(Shift_Codes,IF(MATCH(AD14,Shift_Codes,0)+1>COUNTA(Shift_Codes),1,MATCH(AD14,Shift_Codes,0)+1))))","v":""},{"$f":"IF(OR($C14=\"\",AF$7=\"\"),\"\",IF(AE14=\"\",AD14,INDEX(Shift_Codes,IF(MATCH(AE14,Shift_Codes,0)+1>COUNTA(Shift_Codes),1,MATCH(AE14,Shift_Codes,0)+1))))","v":""},{"$f":"IF(OR($C14=\"\",AG$7=\"\"),\"\",IF(AF14=\"\",AE14,INDEX(Shift_Codes,IF(MATCH(AF14,Shift_Codes,0)+1>COUNTA(Shift_Codes),1,MATCH(AF14,Shift_Codes,0)+1))))","v":""},{"$f":"IF(OR($C14=\"\",AH$7=\"\"),\"\",IF(AG14=\"\",AF14,INDEX(Shift_Codes,IF(MATCH(AG14,Shift_Codes,0)+1>COUNTA(Shift_Codes),1,MATCH(AG14,Shift_Codes,0)+1))))","v":""},{"$f":"IF(OR($C14=\"\",AI$7=\"\"),\"\",IF(AH14=\"\",AG14,INDEX(Shift_Codes,IF(MATCH(AH14,Shift_Codes,0)+1>COUNTA(Shift_Codes),1,MATCH(AH14,Shift_Codes,0)+1))))","v":""},null,0,0]
[null,null,null,null,{"$f":"IF(OR($C15=\"\",E$7=\"\"),\"\",IF(D15=\"\",C15,INDEX(Shift_Codes,IF(MATCH(D15,Shift_Codes,0)+1>COUNTA(Shift_Codes),1,MATCH(D15,Shift_Codes,0)+1))))","v":""},{"$f":"IF(OR($C15=\"\",F$7=\"\"),\"\",IF(E15=\"\",D15,INDEX(Shift_Codes,IF(MATCH(E15,Shift_Codes,0)+1>COUNTA(Shift_Codes),1,MATCH(E15,Shift_Codes,0)+1))))","v":""},{"$f":"IF(OR($C15=\"\",G$7=\"\"),\"\",IF(F15=\"\",E15,INDEX(Shift_Codes,IF(MATCH(F15,Shift_Codes,0)+1>COUNTA(Shift_Codes),1,MATCH(F15,Shift_Codes,0)+1))))","v":""},{"$f":"IF(OR($C15=\"\",H$7=\"\"),\"\",IF(G15=\"\",F15,INDEX(Shift_Codes,IF(MATCH(G15,Shift_Codes,0)+1>COUNTA(Shift_Codes),1,MATCH(G15,Shift_Codes,0)+1))))","v":""},{"$f":"IF(OR($C15=\"\",I$7=\"\"),\"\",IF(H15=\"\",G15,INDEX(Shift_Codes,IF(MATCH(H15,Shift_Codes,0)+1>COUNTA(Shift_Codes),1,MATCH(H15,Shift_Codes,0)+1))))","v":""},{"$f":"IF(OR($C15=\"\",J$7=\"\"),\"\",IF(I15=\"\",H15,INDEX(Shift_Codes,IF(MATCH(I15,Shift_Codes,0)+1>COUNTA(Shift_Codes),1,MATCH(I15,Shift_Codes,0)+1))))","v":""},{"$f":"IF(OR($C15=\"\",K$7=\"\"),\"\",IF(J15=\"\",I15,INDEX(Shift_Codes,IF(MATCH(J15,Shift_Codes,0)+1>COUNTA(Shift_Codes),1,MATCH(J15,Shift_Codes,0)+1))))","v":""},{"$f":"IF(OR($C15=\"\",L$7=\"\"),\"\",IF(K15=\"\",J15,INDEX(Shift_Codes,IF(MATCH(K15,Shift_Codes,0)+1>COUNTA(Shift_Codes),1,MATCH(K15,Shift_Codes,0)+1))))","v":""},{"$f":"IF(OR($C15=\"\",M$7=\"\"),\"\",IF(L15=\"\",K15,INDEX(Shift_Codes,IF(MATCH(L15,Shift_Codes,0)+1>COUNTA(Shift_Codes),1,MATCH(L15,Shift_Codes,0)+1))))","v":""},{"$f":"IF(OR($C15=\"\",N$7=\"\"),\"\",IF(M15=\"\",L15,INDEX(Shift_Codes,IF(MATCH(M15,Shift_Codes,0)+1>COUNTA(Shift_Codes),1,MATCH(M15,Shift_Codes,0)+1))))","v":""},{"$f":"IF(OR($C15=\"\",O$7=\"\"),\"\",IF(N15=\"\",M15,INDEX(Shift_Codes,IF(MATCH(N15,Shift_Codes,0)+1>COUNTA(Shift_Codes),1,MATCH(N15,Shift_Codes,0)+1))))","v":""},{"$f":"IF(OR($C15=\"\",P$7=\"\"),\"\",IF(O15=\"\",N15,INDEX(Shift_Codes,IF(MATCH(O15,Shift_Codes,0)+1>COUNTA(Shift_Codes),1,MATCH(O15,Shift_Codes,0)+1))))","v":""},{"$f":"IF(OR($C15=\"\",Q$7=\"\"),\"\",IF(P15=\"\",O15,INDEX(Shift_Codes,IF(MATCH(P15,Shift_Codes,0)+1>COUNTA(Shift_Codes),1,MATCH(P15,Shift_Codes,0)+1))))","v":""},{"$f":"IF(OR($C15=\"\",R$7=\"\"),\"\",IF(Q15=\"\",P15,INDEX(Shift_Codes,IF(MATCH(Q15,Shift_Codes,0)+1>COUNTA(Shift_Codes),1,MATCH(Q15,Shift_Codes,0)+1))))","v":""},{"$f":"IF(OR($C15=\"\",S$7=\"\"),\"\",IF(R15=\"\",Q15,INDEX(Shift_Codes,IF(MATCH(R15,Shift_Codes,0)+1>COUNTA(Shift_Codes),1,MATCH(R15,Shift_Codes,0)+1))))","v":""},{"$f":"IF(OR($C15=\"\",T$7=\"\"),\"\",IF(S15=\"\",R15,INDEX(Shift_Codes,IF(MATCH(S15,Shift_Codes,0)+1>COUNTA(Shift_Codes),1,MATCH(S15,Shift_Codes,0)+1))))","v":""},{"$f":"IF(OR($C15=\"\",U$7=\"\"),\"\",IF(T15=\"\",S15,INDEX(Shift_Codes,IF(MATCH(T15,Shift_Codes,0)+1>COUNTA(Shift_Codes),1,MATCH(T15,Shift_Codes,0)+1))))","v":""},{"$f":"IF(OR($C15=\"\",V$7=\"\"),\"\",IF(U15=\"\",T15,INDEX(Shift_Codes,IF(MATCH(U15,Shift_Codes,0)+1>COUNTA(Shift_Codes),1,MATCH(U15,Shift_Codes,0)+1))))","v":""},{"$f":"IF(OR($C15=\"\",W$7=\"\"),\"\",IF(V15=\"\",U15,INDEX(Shift_Codes,IF(MATCH(V15,Shift_Codes,0)+1>COUNTA(Shift_Codes),1,MATCH(V15,Shift_Codes,0)+1))))","v":""},{"$f":"IF(OR($C15=\"\",X$7=\"\"),\"\",IF(W15=\"\",V15,INDEX(Shift_Codes,IF(MATCH(W15,Shift_Codes,0)+1>COUNTA(Shift_Codes),1,MATCH(W15,Shift_Codes,0)+1))))","v":""},{"$f":"IF(OR($C15=\"\",Y$7=\"\"),\"\",IF(X15=\"\",W15,INDEX(Shift_Codes,IF(MATCH(X15,Shift_Codes,0)+1>COUNTA(Shift_Codes),1,MATCH(X15,Shift_Codes,0)+1))))","v":""},{"$f":"IF(OR($C15=\"\",Z$7=\"\"),\"\",IF(Y15=\"\",X15,INDEX(Shift_Codes,IF(MATCH(Y15,Shift_Codes,0)+1>COUNTA(Shift_Codes),1,MATCH(Y15,Shift_Codes,0)+1))))","v":""},{"$f":"IF(OR($C15=\"\",AA$7=\"\"),\"\",IF(Z15=\"\",Y15,INDEX(Shift_Codes,IF(MATCH(Z15,Shift_Codes,0)+1>COUNTA(Shift_Codes),1,MATCH(Z15,Shift_Codes,0)+1))))","v":""},{"$f":"IF(OR($C15=\"\",AB$7=\"\"),\"\",IF(AA15=\"\",Z15,INDEX(Shift_Codes,IF(MATCH(AA15,Shift_Codes,0)+1>COUNTA(Shift_Codes),1,MATCH(AA15,Shift_Codes,0)+1))))","v":""},{"$f":"IF(OR($C15=\"\",AC$7=\"\"),\"\",IF(AB15=\"\",AA15,INDEX(Shift_Codes,IF(MATCH(AB15,Shift_Codes,0)+1>COUNTA(Shift_Codes),1,MATCH(AB15,Shift_Codes,0)+1))))","v":""},{"$f":"IF(OR($C15=\"\",AD$7=\"\"),\"\",IF(AC15=\"\",AB15,INDEX(Shift_Codes,IF(MATCH(AC15,Shift_Codes,0)+1>COUNTA(Shift_Codes),1,MATCH(AC15,Shift_Codes,0)+1))))","v":""},{"$f":"IF(OR($C15=\"\",AE$7=\"\"),\"\",IF(AD15=\"\",AC15,INDEX(Shift_Codes,IF(MATCH(AD15,Shift_Codes,0)+1>COUNTA(Shift_Codes),1,MATCH(AD15,Shift_Codes,0)+1))))","v":""},{"$f":"IF(OR($C15=\"\",AF$7=\"\"),\"\",IF(AE15=\"\",AD15,INDEX(Shift_Codes,IF(MATCH(AE15,Shift_Codes,0)+1>COUNTA(Shift_Codes),1,MATCH(AE15,Shift_Codes,0)+1))))","v":""},{"$f":"IF(OR($C15=\"\",AG$7=\"\"),\"\",IF(AF15=\"\",AE15,INDEX(Shift_Codes,IF(MATCH(AF15,Shift_Codes,0)+1>COUNTA(Shift_Codes),1,MATCH(AF15,Shift_Codes,0)+1))))","v":""},{"$f":"IF(OR($C15=\"\",AH$7=\"\"),\"\",IF(AG15=\"\",AF15,INDEX(Shift_Codes,IF(MATCH(AG15,Shift_Codes,0)+1>COUNTA(Shift_Codes),1,MATCH(AG15,Shift_Codes,0)+1))))","v":""},{"$f":"IF(OR($C15=\"\",AI$7=\"\"),\"\",IF(AH15=\"\",AG15,INDEX(Shift_Codes,IF(MATCH(AH15,Shift_Codes,0)+1>COUNTA(Shift_Codes),1,MATCH(AH15,Shift_Codes,0)+1))))","v":""},null,0,0]
[null,null,null,null,{"$f":"IF(OR($C16=\"\",E$7=\"\"),\"\",IF(D16=\"\",C16,INDEX(Shift_Codes,IF(MATCH(D16,Shift_Codes,0)+1>COUNTA(Shift_Codes),1,MATCH(D16,Shift_Codes,0)+1))))","v":""},{"$f":"IF(OR($C16=\"\",F$7=\"\"),\"\",IF(E16=\"\",D16,INDEX(Shift_Codes,IF(MATCH(E16,Shift_Codes,0)+1>COUNTA(Shift_Codes),1,MATCH(E16,Shift_Codes,0)+1))))","v":""},{"$f":"IF(OR($C16=\"\",G$7=\"\"),\"\",IF(F16=\"\",E16,INDEX(Shift_Codes,IF(MATCH(F16,Shift_Codes,0)+1>COUNTA(Shift_Codes),1,MATCH(F16,Shift_Codes,0)+1))))","v":""},{"$f":"IF(OR($C16=\"\",H$7=\"\"),\"\",IF(G16=\"\",F16,INDEX(Shift_Codes,IF(MATCH(G16,Shift_Codes,0)+1>COUNTA(Shift_Codes),1,MATCH(G16,Shift_Codes,0)+1))))","v":""},{"$f":"IF(OR($C16=\"\",I$7=\"\"),\"\",IF(H16=\"\",G16,INDEX(Shift_Codes,IF(MATCH(H16,Shift_Codes,0)+1>COUNTA(Shift_Codes),1,MATCH(H16,Shift_Codes,0)+1))))","v":""},{"$f":"IF(OR($C16=\"\",J$7=\"\"),\"\",IF(I16=\"\",H16,INDEX(Shift_Codes,IF(MATCH(I16,Shift_Codes,0)+1>COUNTA(Shift_Codes),1,MATCH(I16,Shift_Codes,0)+1))))","v":""},{"$f":"IF(OR($C16=\"\",K$7=\"\"),\"\",IF(J16=\"\",I16,INDEX(Shift_Codes,IF(MATCH(J16,Shift_Codes,0)+1>COUNTA(Shift_Codes),1,MATCH(J16,Shift_Codes,0)+1))))","v":""},{"$f":"IF(OR($C16=\"\",L$7=\"\"),\"\",IF(K16=\"\",J16,INDEX(Shift_Codes,IF(MATCH(K16,Shift_Codes,0)+1>COUNTA(Shift_Codes),1,MATCH(K16,Shift_Codes,0)+1))))","v":""},{"$f":"IF(OR($C16=\"\",M$7=\"\"),\"\",IF(L16=\"\",K16,INDEX(Shift_Codes,IF(MATCH(L16,Shift_Codes,0)+1>COUNTA(Shift_Codes),1,MATCH(L16,Shift_Codes,0)+1))))","v":""},{"$f":"IF(OR($C16=\"\",N$7=\"\"),\"\",IF(M16=\"\",L16,INDEX(Shift_Codes,IF(MATCH(M16,Shift_Codes,0)+1>COUNTA(Shift_Codes),1,MATCH(M16,Shift_Codes,0)+1))))","v":""},{"$f":"IF(OR($C16=\"\",O$7=\"\"),\"\",IF(N16=\"\",M16,INDEX(Shift_Codes,IF(MATCH(N16,Shift_Codes,0)+1>COUNTA(Shift_Codes),1,MATCH(N16,Shift_Codes,0)+1))))","v":""},{"$f":"IF(OR($C16=\"\",P$7=\"\"),\"\",IF(O16=\"\",N16,INDEX(Shift_Codes,IF(MATCH(O16,Shift_Codes,0)+1>COUNTA(Shift_Codes),1,MATCH(O16,Shift_Codes,0)+1))))","v":""},{"$f":"IF(OR($C16=\"\",Q$7=\"\"),\"\",IF(P16=\"\",O16,INDEX(Shift_Codes,IF(MATCH(P16,Shift_Codes,0)+1>COUNTA(Shift_Codes),1,MATCH(P16,Shift_Codes,0)+1))))","v":""},{"$f":"IF(OR($C16=\"\",R$7=\"\"),\"\",IF(Q16=\"\",P16,INDEX(Shift_Codes,IF(MATCH(Q16,Shift_Codes,0)+1>COUNTA(Shift_Codes),1,MATCH(Q16,Shift_Codes,0)+1))))","v":""},{"$f":"IF(OR($C16=\"\",S$7=\"\"),\"\",IF(R16=\"\",Q16,INDEX(Shift_Codes,IF(MATCH(R16,Shift_Codes,0)+1>COUNTA(Shift_Codes),1,MATCH(R16,Shift_Codes,0)+1))))","v":""},{"$f":"IF(OR($C16=\"\",T$7=\"\"),\"\",IF(S16=\"\",R16,INDEX(Shift_Codes,IF(MATCH(S16,Shift_Codes,0)+1>COUNTA(Shift_Codes),1,MATCH(S16,Shift_Codes,0)+1))))","v":""},{"$f":"IF(OR($C16=\"\",U$7=\"\"),\"\",IF(T16=\"\",S16,INDEX(Shift_Codes,IF(MATCH(T16,Shift_Codes,0)+1>COUNTA(Shift_Codes),1,MATCH(T16,Shift_Codes,0)+1))))","v":""},{"$f":"IF(OR($C16=\"\",V$7=\"\"),\"\",IF(U16=\"\",T16,INDEX(Shift_Codes,IF(MATCH(U16,Shift_Codes,0)+1>COUNTA(Shift_Codes),1,MATCH(U16,Shift_Codes,0)+1))))","v":""},{"$f":"IF(OR($C16=\"\",W$7=\"\"),\"\",IF(V16=\"\",U16,INDEX(Shift_Codes,IF(MATCH(V16,Shift_Codes,0)+1>COUNTA(Shift_Codes),1,MATCH(V16,Shift_Codes,0)+1))))","v":""},{"$f":"IF(OR($C16=\"\",X$7=\"\"),\"\",IF(W16=\"\",V16,INDEX(Shift_Codes,IF(MATCH(W16,Shift_Codes,0)+1>COUNTA(Shift_Codes),1,MATCH(W16,Shift_Codes,0)+1))))","v":""},{"$f":"IF(OR($C16=\"\",Y$7=\"\"),\"\",IF(X16=\"\",W16,INDEX(Shift_Codes,IF(MATCH(X16,Shift_Codes,0)+1>COUNTA(Shift_Codes),1,MATCH(X16,Shift_Codes,0)+1))))","v":""},{"$f":"IF(OR($C16=\"\",Z$7=\"\"),\"\",IF(Y16=\"\",X16,INDEX(Shift_Codes,IF(MATCH(Y16,Shift_Codes,0)+1>COUNTA(Shift_Codes),1,MATCH(Y16,Shift_Codes,0)+1))))","v":""},{"$f":"IF(OR($C16=\"\",AA$7=\"\"),\"\",IF(Z16=\"\",Y16,INDEX(Shift_Codes,IF(MATCH(Z16,Shift_Codes,0)+1>COUNTA(Shift_Codes),1,MATCH(Z16,Shift_Codes,0)+1))))","v":""},{"$f":"IF(OR($C16=\"\",AB$7=\"\"),\"\",IF(AA16=\"\",Z16,INDEX(Shift_Codes,IF(MATCH(AA16,Shift_Codes,0)+1>COUNTA(Shift_Codes),1,MATCH(AA16,Shift_Codes,0)+1))))","v":""},{"$f":"IF(OR($C16=\"\",AC$7=\"\"),\"\",IF(AB16=\"\",AA16,INDEX(Shift_Codes,IF(MATCH(AB16,Shift_Codes,0)+1>COUNTA(Shift_Codes),1,MATCH(AB16,Shift_Codes,0)+1))))","v":""},{"$f":"IF(OR($C16=\"\",AD$7=\"\"),\"\",IF(AC16=\"\",AB16,INDEX(Shift_Codes,IF(MATCH(AC16,Shift_Codes,0)+1>COUNTA(Shift_Codes),1,MATCH(AC16,Shift_Codes,0)+1))))","v":""},{"$f":"IF(OR($C16=\"\",AE$7=\"\"),\"\",IF(AD16=\"\",AC16,INDEX(Shift_Codes,IF(MATCH(AD16,Shift_Codes,0)+1>COUNTA(Shift_Codes),1,MATCH(AD16,Shift_Codes,0)+1))))","v":""},{"$f":"IF(OR($C16=\"\",AF$7=\"\"),\"\",IF(AE16=\"\",AD16,INDEX(Shift_Codes,IF(MATCH(AE16,Shift_Codes,0)+1>COUNTA(Shift_Codes),1,MATCH(AE16,Shift_Codes,0)+1))))","v":""},{"$f":"IF(OR($C16=\"\",AG$7=\"\"),\"\",IF(AF16=\"\",AE16,INDEX(Shift_Codes,IF(MATCH(AF16,Shift_Codes,0)+1>COUNTA(Shift_Codes),1,MATCH(AF16,Shift_Codes,0)+1))))","v":""},{"$f":"IF(OR($C16=\"\",AH$7=\"\"),\"\",IF(AG16=\"\",AF16,INDEX(Shift_Codes,IF(MATCH(AG16,Shift_Codes,0)+1>COUNTA(Shift_Codes),1,MATCH(AG16,Shift_Codes,0)+1))))","v":""},{"$f":"IF(OR($C16=\"\",AI$7=\"\"),\"\",IF(AH16=\"\",AG16,INDEX(Shift_Codes,IF(MATCH(AH16,Shift_Codes,0)+1>COUNTA(Shift_Codes),1,MATCH(AH16,Shift_Codes,0)+1))))","v":""},null,0,0]
[null,null,null,null,{"$f":"IF(OR($C17=\"\",E$7=\"\"),\"\",IF(D17=\"\",C17,INDEX(Shift_Codes,IF(MATCH(D17,Shift_Codes,0)+1>COUNTA(Shift_Codes),1,MATCH(D17,Shift_Codes,0)+1))))","v":""},{"$f":"IF(OR($C17=\"\",F$7=\"\"),\"\",IF(E17=\"\",D17,INDEX(Shift_Codes,IF(MATCH(E17,Shift_Codes,0)+1>COUNTA(Shift_Codes),1,MATCH(E17,Shift_Codes,0)+1))))","v":""},{"$f":"IF(OR($C17=\"\",G$7=\"\"),\"\",IF(F17=\"\",E17,INDEX(Shift_Codes,IF(MATCH(F17,Shift_Codes,0)+1>COUNTA(Shift_Codes),1,MATCH(F17,Shift_Codes,0)+1))))","v":""},{"$f":"IF(OR($C17=\"\",H$7=\"\"),\"\",IF(G17=\"\",F17,INDEX(Shift_Codes,IF(MATCH(G17,Shift_Codes,0)+1>COUNTA(Shift_Codes),1,MATCH(G17,Shift_Codes,0)+1))))","v":""},{"$f":"IF(OR($C17=\"\",I$7=\"\"),\"\",IF(H17=\"\",G17,INDEX(Shift_Codes,IF(MATCH(H17,Shift_Codes,0)+1>COUNTA(Shift_Codes),1,MATCH(H17,Shift_Codes,0)+1))))","v":""},{"$f":"IF(OR($C17=\"\",J$7=\"\"),\"\",IF(I17=\"\",H17,INDEX(Shift_Codes,IF(MATCH(I17,Shift_Codes,0)+1>COUNTA(Shift_Codes),1,MATCH(I17,Shift_Codes,0)+1))))","v":""},{"$f":"IF(OR($C17=\"\",K$7=\"\"),\"\",IF(J17=\"\",I17,INDEX(Shift_Codes,IF(MATCH(J17,Shift_Codes,0)+1>COUNTA(Shift_Codes),1,MATCH(J17,Shift_Codes,0)+1))))","v":""},{"$f":"IF(OR($C17=\"\",L$7=\"\"),\"\",IF(K17=\"\",J17,INDEX(Shift_Codes,IF(MATCH(K17,Shift_Codes,0)+1>COUNTA(Shift_Codes),1,MATCH(K17,Shift_Codes,0)+1))))","v":""},{"$f":"IF(OR($C17=\"\",M$7=\"\"),\"\",IF(L17=\"\",K17,INDEX(Shift_Codes,IF(MATCH(L17,Shift_Codes,0)+1>COUNTA(Shift_Codes),1,MATCH(L17,Shift_Codes,0)+1))))","v":""},{"$f":"IF(OR($C17=\"\",N$7=\"\"),\"\",IF(M17=\"\",L17,INDEX(Shift_Codes,IF(MATCH(M17,Shift_Codes,0)+1>COUNTA(Shift_Codes),1,MATCH(M17,Shift_Codes,0)+1))))","v":""},{"$f":"IF(OR($C17=\"\",O$7=\"\"),\"\",IF(N17=\"\",M17,INDEX(Shift_Codes,IF(MATCH(N17,Shift_Codes,0)+1>COUNTA(Shift_Codes),1,MATCH(N17,Shift_Codes,0)+1))))","v":""},{"$f":"IF(OR($C17=\"\",P$7=\"\"),\"\",IF(O17=\"\",N17,INDEX(Shift_Codes,IF(MATCH(O17,Shift_Codes,0)+1>COUNTA(Shift_Codes),1,MATCH(O17,Shift_Codes,0)+1))))","v":""},{"$f":"IF(OR($C17=\"\",Q$7=\"\"),\"\",IF(P17=\"\",O17,INDEX(Shift_Codes,IF(MATCH(P17,Shift_Codes,0)+1>COUNTA(Shift_Codes),1,MATCH(P17,Shift_Codes,0)+1))))","v":""},{"$f":"IF(OR($C17=\"\",R$7=\"\"),\"\",IF(Q17=\"\",P17,INDEX(Shift_Codes,IF(MATCH(Q17,Shift_Codes,0)+1>COUNTA(Shift_Codes),1,MATCH(Q17,Shift_Codes,0)+1))))","v":""},{"$f":"IF(OR($C17=\"\",S$7=\"\"),\"\",IF(R17=\"\",Q17,INDEX(Shift_Codes,IF(MATCH(R17,Shift_Codes,0)+1>COUNTA(Shift_Codes),1,MATCH(R17,Shift_Codes,0)+1))))","v":""},{"$f":"IF(OR($C17=\"\",T$7=\"\"),\"\",IF(S17=\"\",R17,INDEX(Shift_Codes,IF(MATCH(S17,Shift_Codes,0)+1>COUNTA(Shift_Codes),1,MATCH(S17,Shift_Codes,0)+1))))","v":""},{"$f":"IF(OR($C17=\"\",U$7=\"\"),\"\",IF(T17=\"\",S17,INDEX(Shift_Codes,IF(MATCH(T17,Shift_Codes,0)+1>COUNTA(Shift_Codes),1,MATCH(T17,Shift_Codes,0)+1))))","v":""},{"$f":"IF(OR($C17=\"\",V$7=\"\"),\"\",IF(U17=\"\",T17,INDEX(Shift_Codes,IF(MATCH(U17,Shift_Codes,0)+1>COUNTA(Shift_Codes),1,MATCH(U17,Shift_Codes,0)+1))))","v":""},{"$f":"IF(OR($C17=\"\",W$7=\"\"),\"\",IF(V17=\"\",U17,INDEX(Shift_Codes,IF(MATCH(V17,Shift_Codes,0)+1>COUNTA(Shift_Codes),1,MATCH(V17,Shift_Codes,0)+1))))","v":""},{"$f":"IF(OR($C17=\"\",X$7=\"\"),\"\",IF(W17=\"\",V17,INDEX(Shift_Codes,IF(MATCH(W17,Shift_Codes,0)+1>COUNTA(Shift_Codes),1,MATCH(W17,Shift_Codes,0)+1))))","v":""},{"$f":"IF(OR($C17=\"\",Y$7=\"\"),\"\",IF(X17=\"\",W17,INDEX(Shift_Codes,IF(MATCH(X17,Shift_Codes,0)+1>COUNTA(Shift_Codes),1,MATCH(X17,Shift_Codes,0)+1))))","v":""},{"$f":"IF(OR($C17=\"\",Z$7=\"\"),\"\",IF(Y17=\"\",X17,INDEX(Shift_Codes,IF(MATCH(Y17,Shift_Codes,0)+1>COUNTA(Shift_Codes),1,MATCH(Y17,Shift_Codes,0)+1))))","v":""},{"$f":"IF(OR($C17=\"\",AA$7=\"\"),\"\",IF(Z17=\"\",Y17,INDEX(Shift_Codes,IF(MATCH(Z17,Shift_Codes,0)+1>COUNTA(Shift_Codes),1,MATCH(Z17,Shift_Codes,0)+1))))","v":""},{"$f":"IF(OR($C17=\"\",AB$7=\"\"),\"\",IF(AA17=\"\",Z17,INDEX(Shift_Codes,IF(MATCH(AA17,Shift_Codes,0)+1>COUNTA(Shift_Codes),1,MATCH(AA17,Shift_Codes,0)+1))))","v":""},{"$f":"IF(OR($C17=\"\",AC$7=\"\"),\"\",IF(AB17=\"\",AA17,INDEX(Shift_Codes,IF(MATCH(AB17,Shift_Codes,0)+1>COUNTA(Shift_Codes),1,MATCH(AB17,Shift_Codes,0)+1))))","v":""},{"$f":"IF(OR($C17=\"\",AD$7=\"\"),\"\",IF(AC17=\"\",AB17,INDEX(Shift_Codes,IF(MATCH(AC17,Shift_Codes,0)+1>COUNTA(Shift_Codes),1,MATCH(AC17,Shift_Codes,0)+1))))","v":""},{"$f":"IF(OR($C17=\"\",AE$7=\"\"),\"\",IF(AD17=\"\",AC17,INDEX(Shift_Codes,IF(MATCH(AD17,Shift_Codes,0)+1>COUNTA(Shift_Codes),1,MATCH(AD17,Shift_Codes,0)+1))))","v":""},{"$f":"IF(OR($C17=\"\",AF$7=\"\"),\"\",IF(AE17=\"\",AD17,INDEX(Shift_Codes,IF(MATCH(AE17,Shift_Codes,0)+1>COUNTA(Shift_Codes),1,MATCH(AE17,Shift_Codes,0)+1))))","v":""},{"$f":"IF(OR($C17=\"\",AG$7=\"\"),\"\",IF(AF17=\"\",AE17,INDEX(Shift_Codes,IF(MATCH(AF17,Shift_Codes,0)+1>COUNTA(Shift_Codes),1,MATCH(AF17,Shift_Codes,0)+1))))","v":""},{"$f":"IF(OR($C17=\"\",AH$7=\"\"),\"\",IF(AG17=\"\",AF17,INDEX(Shift_Codes,IF(MATCH(AG17,Shift_Codes,0)+1>COUNTA(Shift_Codes),1,MATCH(AG17,Shift_Codes,0)+1))))","v":""},{"$f":"IF(OR($C17=\"\",AI$7=\"\"),\"\",IF(AH17=\"\",AG17,INDEX(Shift_Codes,IF(MATCH(AH17,Shift_Codes,0)+1>COUNTA(Shift_Codes),1,MATCH(AH17,Shift_Codes,0)+1))))","v":""},null,0,0]
[]
[null,"Total Day Shift Employees",null,null,{"$f":"COUNTIF(E$8:E$17,\"D*\")","v":1},{"$f":"COUNTIF(F$8:F$17,\"D*\")","v":0},0,0,1,1,1,0,0,0,1,1,1,0,0,0,1,1,1,0,0,0,1,1,1,0,0,0,1,1,1]
[null,"Total Night Shift Employees",null,null,{"$f":"COUNTIF(E$8:E$17,\"N*\")","v":0},{"$f":"COUNTIF(F$8:F$17,\"N*\")","v":1},1,1,0,0,0,1,1,1,0,0,0,1,1,1,0,0,0,1,1,1,0,0,0,1,1,1,0,0,0]