{"text_format":"1","workbook":"xlsx","n_sheets":3,"sheets":["COMBIN","Formula","VBA"],"not_rendered":{"charts":0,"images":0,"macros":1,"external_links":0,"defined_names":0,"comments":0,"pivot_tables":0},"unopened":[],"bounds":{"document_bytes":16777216,"sheet_cells":100000,"rows_first":2000,"rows_last":500,"rows_between":2000,"halvings":0,"cell_chars":16384,"cell_head_chars":4096},"cells_cut":0,"cells_raw":0,"read":"whole","date_system":"1900"}

{"sheet":"COMBIN","index":0,"n_rows":13,"n_cols":3,"rows_kept":13,"cut":false,"hidden":false,"merged":[[11,1,11,2],[12,1,12,2],[1,1,1,2]]}
[]
[null,"Using COMBIN Function"]
[]
[null,"Candidate No","Name"]
[null,1,"Robert Lewandowski"]
[null,2,"Wojciech Szczęsny"]
[null,3,"Arkadiusz Milik"]
[null,4,"Krzysztof Piątek"]
[null,5,"Piotr Zieliński"]
[null,6,"Jan Bednarek"]
[]
[null,"Possible Combinations Without Repetition"]
[null,{"$f":"COMBIN(6,4)","v":15}]

{"sheet":"Formula","index":1,"n_rows":24,"n_cols":3,"rows_kept":24,"cut":false,"hidden":false,"merged":[[22,1,22,2],[23,1,23,2],[16,1,16,2],[17,1,17,2],[18,1,18,2],[19,1,19,2],[20,1,20,2],[21,1,21,2],[1,1,1,2],[11,1,11,2],[12,1,12,2],[13,1,13,2],[14,1,14,2],[15,1,15,2]]}
[]
[null,"Employing a Formula"]
[]
[null,"Name","Position"]
[null,"Robert Lewandowski","Forward"]
[null,"Wojciech Szczęsny","Goalkeeper"]
[null,"Arkadiusz Milik","Striker"]
[null,"Krzysztof Piątek","Midfielder"]
[null,"Piotr Zieliński","Right Back"]
[null,"Jan Bednarek","Center Back"]
[]
[null,"Possible Combinations Without Repetition"]
[null,{"$f":"IF(ROW()-ROW($B$13)+1>COUNTA($B$5:$B$8)*COUNTA($C$5:$C$7),\"\",INDEX($B$5:$B$8,INT((ROW()-ROW($B$13))/COUNTA($C$5:$C$7)+1))&\"-\"&INDEX($C$5:$C$7,MOD(ROW()-ROW($B$13),COUNTA($C$5:$C$7))+1))","v":"Robert Lewandowski-Forward"}]
[null,{"$f":"IF(ROW()-ROW($B$13)+1>COUNTA($B$5:$B$8)*COUNTA($C$5:$C$7),\"\",INDEX($B$5:$B$8,INT((ROW()-ROW($B$13))/COUNTA($C$5:$C$7)+1))&\"-\"&INDEX($C$5:$C$7,MOD(ROW()-ROW($B$13),COUNTA($C$5:$C$7))+1))","v":"Robert Lewandowski-Goalkeeper"}]
[null,{"$f":"IF(ROW()-ROW($B$13)+1>COUNTA($B$5:$B$8)*COUNTA($C$5:$C$7),\"\",INDEX($B$5:$B$8,INT((ROW()-ROW($B$13))/COUNTA($C$5:$C$7)+1))&\"-\"&INDEX($C$5:$C$7,MOD(ROW()-ROW($B$13),COUNTA($C$5:$C$7))+1))","v":"Robert Lewandowski-Striker"}]
[null,{"$f":"IF(ROW()-ROW($B$13)+1>COUNTA($B$5:$B$8)*COUNTA($C$5:$C$7),\"\",INDEX($B$5:$B$8,INT((ROW()-ROW($B$13))/COUNTA($C$5:$C$7)+1))&\"-\"&INDEX($C$5:$C$7,MOD(ROW()-ROW($B$13),COUNTA($C$5:$C$7))+1))","v":"Wojciech Szczęsny-Forward"}]
[null,{"$f":"IF(ROW()-ROW($B$13)+1>COUNTA($B$5:$B$8)*COUNTA($C$5:$C$7),\"\",INDEX($B$5:$B$8,INT((ROW()-ROW($B$13))/COUNTA($C$5:$C$7)+1))&\"-\"&INDEX($C$5:$C$7,MOD(ROW()-ROW($B$13),COUNTA($C$5:$C$7))+1))","v":"Wojciech Szczęsny-Goalkeeper"}]
[null,{"$f":"IF(ROW()-ROW($B$13)+1>COUNTA($B$5:$B$8)*COUNTA($C$5:$C$7),\"\",INDEX($B$5:$B$8,INT((ROW()-ROW($B$13))/COUNTA($C$5:$C$7)+1))&\"-\"&INDEX($C$5:$C$7,MOD(ROW()-ROW($B$13),COUNTA($C$5:$C$7))+1))","v":"Wojciech Szczęsny-Striker"}]
[null,{"$f":"IF(ROW()-ROW($B$13)+1>COUNTA($B$5:$B$8)*COUNTA($C$5:$C$7),\"\",INDEX($B$5:$B$8,INT((ROW()-ROW($B$13))/COUNTA($C$5:$C$7)+1))&\"-\"&INDEX($C$5:$C$7,MOD(ROW()-ROW($B$13),COUNTA($C$5:$C$7))+1))","v":"Arkadiusz Milik-Forward"}]
[null,{"$f":"IF(ROW()-ROW($B$13)+1>COUNTA($B$5:$B$8)*COUNTA($C$5:$C$7),\"\",INDEX($B$5:$B$8,INT((ROW()-ROW($B$13))/COUNTA($C$5:$C$7)+1))&\"-\"&INDEX($C$5:$C$7,MOD(ROW()-ROW($B$13),COUNTA($C$5:$C$7))+1))","v":"Arkadiusz Milik-Goalkeeper"}]
[null,{"$f":"IF(ROW()-ROW($B$13)+1>COUNTA($B$5:$B$8)*COUNTA($C$5:$C$7),\"\",INDEX($B$5:$B$8,INT((ROW()-ROW($B$13))/COUNTA($C$5:$C$7)+1))&\"-\"&INDEX($C$5:$C$7,MOD(ROW()-ROW($B$13),COUNTA($C$5:$C$7))+1))","v":"Arkadiusz Milik-Striker"}]
[null,{"$f":"IF(ROW()-ROW($B$13)+1>COUNTA($B$5:$B$8)*COUNTA($C$5:$C$7),\"\",INDEX($B$5:$B$8,INT((ROW()-ROW($B$13))/COUNTA($C$5:$C$7)+1))&\"-\"&INDEX($C$5:$C$7,MOD(ROW()-ROW($B$13),COUNTA($C$5:$C$7))+1))","v":"Krzysztof Piątek-Forward"}]
[null,{"$f":"IF(ROW()-ROW($B$13)+1>COUNTA($B$5:$B$8)*COUNTA($C$5:$C$7),\"\",INDEX($B$5:$B$8,INT((ROW()-ROW($B$13))/COUNTA($C$5:$C$7)+1))&\"-\"&INDEX($C$5:$C$7,MOD(ROW()-ROW($B$13),COUNTA($C$5:$C$7))+1))","v":"Krzysztof Piątek-Goalkeeper"}]
[null,{"$f":"IF(ROW()-ROW($B$13)+1>COUNTA($B$5:$B$8)*COUNTA($C$5:$C$7),\"\",INDEX($B$5:$B$8,INT((ROW()-ROW($B$13))/COUNTA($C$5:$C$7)+1))&\"-\"&INDEX($C$5:$C$7,MOD(ROW()-ROW($B$13),COUNTA($C$5:$C$7))+1))","v":"Krzysztof Piątek-Striker"}]

{"sheet":"VBA","index":2,"n_rows":220,"n_cols":6,"rows_kept":220,"cut":false,"hidden":false,"merged":[[1,1,1,5]]}
[]
[null,"Applying VBA Macros"]
[]
[null,"Name","Position","Club",null,"Possible Combinations Without Repetition"]
[null,"Robert Lewandowski","Forward","Barcelona",null,"Robert Lewandowski-Forward-Barcelona"]
[null,"Wojciech Szczęsny","Goalkeeper","Juventus",null,"Robert Lewandowski-Forward-Juventus"]
[null,"Arkadiusz Milik","Striker","Napoli",null,"Robert Lewandowski-Forward-Napoli"]
[null,"Krzysztof Piątek","Midfielder","Bayern",null,"Robert Lewandowski-Forward-Bayern"]
[null,"Piotr Zieliński","Right Back","Southampton",null,"Robert Lewandowski-Forward-Southampton"]
[null,"Jan Bednarek","Center Back","Arsenal",null,"Robert Lewandowski-Forward-Arsenal"]
[null,null,null,null,null,"Robert Lewandowski-Goalkeeper-Barcelona"]
[null,null,null,null,null,"Robert Lewandowski-Goalkeeper-Juventus"]
[null,null,null,null,null,"Robert Lewandowski-Goalkeeper-Napoli"]
[null,null,null,null,null,"Robert Lewandowski-Goalkeeper-Bayern"]
[null,null,null,null,null,"Robert Lewandowski-Goalkeeper-Southampton"]
[null,null,null,null,null,"Robert Lewandowski-Goalkeeper-Arsenal"]
[null,null,null,null,null,"Robert Lewandowski-Striker-Barcelona"]
[null,null,null,null,null,"Robert Lewandowski-Striker-Juventus"]
[null,null,null,null,null,"Robert Lewandowski-Striker-Napoli"]
[null,null,null,null,null,"Robert Lewandowski-Striker-Bayern"]
[null,null,null,null,null,"Robert Lewandowski-Striker-Southampton"]
[null,null,null,null,null,"Robert Lewandowski-Striker-Arsenal"]
[null,null,null,null,null,"Robert Lewandowski-Midfielder-Barcelona"]
[null,null,null,null,null,"Robert Lewandowski-Midfielder-Juventus"]
[null,null,null,null,null,"Robert Lewandowski-Midfielder-Napoli"]
[null,null,null,null,null,"Robert Lewandowski-Midfielder-Bayern"]
[null,null,null,null,null,"Robert Lewandowski-Midfielder-Southampton"]
[null,null,null,null,null,"Robert Lewandowski-Midfielder-Arsenal"]
[null,null,null,null,null,"Robert Lewandowski-Right Back-Barcelona"]
[null,null,null,null,null,"Robert Lewandowski-Right Back-Juventus"]
[null,null,null,null,null,"Robert Lewandowski-Right Back-Napoli"]
[null,null,null,null,null,"Robert Lewandowski-Right Back-Bayern"]
[null,null,null,null,null,"Robert Lewandowski-Right Back-Southampton"]
[null,null,null,null,null,"Robert Lewandowski-Right Back-Arsenal"]
[null,null,null,null,null,"Robert Lewandowski-Center Back-Barcelona"]
[null,null,null,null,null,"Robert Lewandowski-Center Back-Juventus"]
[null,null,null,null,null,"Robert Lewandowski-Center Back-Napoli"]
[null,null,null,null,null,"Robert Lewandowski-Center Back-Bayern"]
[null,null,null,null,null,"Robert Lewandowski-Center Back-Southampton"]
[null,null,null,null,null,"Robert Lewandowski-Center Back-Arsenal"]
[null,null,null,null,null,"Wojciech Szczęsny-Forward-Barcelona"]
[null,null,null,null,null,"Wojciech Szczęsny-Forward-Juventus"]
[null,null,null,null,null,"Wojciech Szczęsny-Forward-Napoli"]
[null,null,null,null,null,"Wojciech Szczęsny-Forward-Bayern"]
[null,null,null,null,null,"Wojciech Szczęsny-Forward-Southampton"]
[null,null,null,null,null,"Wojciech Szczęsny-Forward-Arsenal"]
[null,null,null,null,null,"Wojciech Szczęsny-Goalkeeper-Barcelona"]
[null,null,null,null,null,"Wojciech Szczęsny-Goalkeeper-Juventus"]
[null,null,null,null,null,"Wojciech Szczęsny-Goalkeeper-Napoli"]
[null,null,null,null,null,"Wojciech Szczęsny-Goalkeeper-Bayern"]
[null,null,null,null,null,"Wojciech Szczęsny-Goalkeeper-Southampton"]
[null,null,null,null,null,"Wojciech Szczęsny-Goalkeeper-Arsenal"]
[null,null,null,null,null,"Wojciech Szczęsny-Striker-Barcelona"]
[null,null,null,null,null,"Wojciech Szczęsny-Striker-Juventus"]
[null,null,null,null,null,"Wojciech Szczęsny-Striker-Napoli"]
[null,null,null,null,null,"Wojciech Szczęsny-Striker-Bayern"]
[null,null,null,null,null,"Wojciech Szczęsny-Striker-Southampton"]
[null,null,null,null,null,"Wojciech Szczęsny-Striker-Arsenal"]
[null,null,null,null,null,"Wojciech Szczęsny-Midfielder-Barcelona"]
[null,null,null,null,null,"Wojciech Szczęsny-Midfielder-Juventus"]
[null,null,null,null,null,"Wojciech Szczęsny-Midfielder-Napoli"]
[null,null,null,null,null,"Wojciech Szczęsny-Midfielder-Bayern"]
[null,null,null,null,null,"Wojciech Szczęsny-Midfielder-Southampton"]
[null,null,null,null,null,"Wojciech Szczęsny-Midfielder-Arsenal"]
[null,null,null,null,null,"Wojciech Szczęsny-Right Back-Barcelona"]
[null,null,null,null,null,"Wojciech Szczęsny-Right Back-Juventus"]
[null,null,null,null,null,"Wojciech Szczęsny-Right Back-Napoli"]
[null,null,null,null,null,"Wojciech Szczęsny-Right Back-Bayern"]
[null,null,null,null,null,"Wojciech Szczęsny-Right Back-Southampton"]
[null,null,null,null,null,"Wojciech Szczęsny-Right Back-Arsenal"]
[null,null,null,null,null,"Wojciech Szczęsny-Center Back-Barcelona"]
[null,null,null,null,null,"Wojciech Szczęsny-Center Back-Juventus"]
[null,null,null,null,null,"Wojciech Szczęsny-Center Back-Napoli"]
[null,null,null,null,null,"Wojciech Szczęsny-Center Back-Bayern"]
[null,null,null,null,null,"Wojciech Szczęsny-Center Back-Southampton"]
[null,null,null,null,null,"Wojciech Szczęsny-Center Back-Arsenal"]
[null,null,null,null,null,"Arkadiusz Milik-Forward-Barcelona"]
[null,null,null,null,null,"Arkadiusz Milik-Forward-Juventus"]
[null,null,null,null,null,"Arkadiusz Milik-Forward-Napoli"]
[null,null,null,null,null,"Arkadiusz Milik-Forward-Bayern"]
[null,null,null,null,null,"Arkadiusz Milik-Forward-Southampton"]
[null,null,null,null,null,"Arkadiusz Milik-Forward-Arsenal"]
[null,null,null,null,null,"Arkadiusz Milik-Goalkeeper-Barcelona"]
[null,null,null,null,null,"Arkadiusz Milik-Goalkeeper-Juventus"]
[null,null,null,null,null,"Arkadiusz Milik-Goalkeeper-Napoli"]
[null,null,null,null,null,"Arkadiusz Milik-Goalkeeper-Bayern"]
[null,null,null,null,null,"Arkadiusz Milik-Goalkeeper-Southampton"]
[null,null,null,null,null,"Arkadiusz Milik-Goalkeeper-Arsenal"]
[null,null,null,null,null,"Arkadiusz Milik-Striker-Barcelona"]
[null,null,null,null,null,"Arkadiusz Milik-Striker-Juventus"]
[null,null,null,null,null,"Arkadiusz Milik-Striker-Napoli"]
[null,null,null,null,null,"Arkadiusz Milik-Striker-Bayern"]
[null,null,null,null,null,"Arkadiusz Milik-Striker-Southampton"]
[null,null,null,null,null,"Arkadiusz Milik-Striker-Arsenal"]
[null,null,null,null,null,"Arkadiusz Milik-Midfielder-Barcelona"]
[null,null,null,null,null,"Arkadiusz Milik-Midfielder-Juventus"]
[null,null,null,null,null,"Arkadiusz Milik-Midfielder-Napoli"]
[null,null,null,null,null,"Arkadiusz Milik-Midfielder-Bayern"]
[null,null,null,null,null,"Arkadiusz Milik-Midfielder-Southampton"]
[null,null,null,null,null,"Arkadiusz Milik-Midfielder-Arsenal"]
[null,null,null,null,null,"Arkadiusz Milik-Right Back-Barcelona"]
[null,null,null,null,null,"Arkadiusz Milik-Right Back-Juventus"]
[null,null,null,null,null,"Arkadiusz Milik-Right Back-Napoli"]
[null,null,null,null,null,"Arkadiusz Milik-Right Back-Bayern"]
[null,null,null,null,null,"Arkadiusz Milik-Right Back-Southampton"]
[null,null,null,null,null,"Arkadiusz Milik-Right Back-Arsenal"]
[null,null,null,null,null,"Arkadiusz Milik-Center Back-Barcelona"]
[null,null,null,null,null,"Arkadiusz Milik-Center Back-Juventus"]
[null,null,null,null,null,"Arkadiusz Milik-Center Back-Napoli"]
[null,null,null,null,null,"Arkadiusz Milik-Center Back-Bayern"]
[null,null,null,null,null,"Arkadiusz Milik-Center Back-Southampton"]
[null,null,null,null,null,"Arkadiusz Milik-Center Back-Arsenal"]
[null,null,null,null,null,"Krzysztof Piątek-Forward-Barcelona"]
[null,null,null,null,null,"Krzysztof Piątek-Forward-Juventus"]
[null,null,null,null,null,"Krzysztof Piątek-Forward-Napoli"]
[null,null,null,null,null,"Krzysztof Piątek-Forward-Bayern"]
[null,null,null,null,null,"Krzysztof Piątek-Forward-Southampton"]
[null,null,null,null,null,"Krzysztof Piątek-Forward-Arsenal"]
[null,null,null,null,null,"Krzysztof Piątek-Goalkeeper-Barcelona"]
[null,null,null,null,null,"Krzysztof Piątek-Goalkeeper-Juventus"]
[null,null,null,null,null,"Krzysztof Piątek-Goalkeeper-Napoli"]
[null,null,null,null,null,"Krzysztof Piątek-Goalkeeper-Bayern"]
[null,null,null,null,null,"Krzysztof Piątek-Goalkeeper-Southampton"]
[null,null,null,null,null,"Krzysztof Piątek-Goalkeeper-Arsenal"]
[null,null,null,null,null,"Krzysztof Piątek-Striker-Barcelona"]
[null,null,null,null,null,"Krzysztof Piątek-Striker-Juventus"]
[null,null,null,null,null,"Krzysztof Piątek-Striker-Napoli"]
[null,null,null,null,null,"Krzysztof Piątek-Striker-Bayern"]
[null,null,null,null,null,"Krzysztof Piątek-Striker-Southampton"]
[null,null,null,null,null,"Krzysztof Piątek-Striker-Arsenal"]
[null,null,null,null,null,"Krzysztof Piątek-Midfielder-Barcelona"]
[null,null,null,null,null,"Krzysztof Piątek-Midfielder-Juventus"]
[null,null,null,null,null,"Krzysztof Piątek-Midfielder-Napoli"]
[null,null,null,null,null,"Krzysztof Piątek-Midfielder-Bayern"]
[null,null,null,null,null,"Krzysztof Piątek-Midfielder-Southampton"]
[null,null,null,null,null,"Krzysztof Piątek-Midfielder-Arsenal"]
[null,null,null,null,null,"Krzysztof Piątek-Right Back-Barcelona"]
[null,null,null,null,null,"Krzysztof Piątek-Right Back-Juventus"]
[null,null,null,null,null,"Krzysztof Piątek-Right Back-Napoli"]
[null,null,null,null,null,"Krzysztof Piątek-Right Back-Bayern"]
[null,null,null,null,null,"Krzysztof Piątek-Right Back-Southampton"]
[null,null,null,null,null,"Krzysztof Piątek-Right Back-Arsenal"]
[null,null,null,null,null,"Krzysztof Piątek-Center Back-Barcelona"]
[null,null,null,null,null,"Krzysztof Piątek-Center Back-Juventus"]
[null,null,null,null,null,"Krzysztof Piątek-Center Back-Napoli"]
[null,null,null,null,null,"Krzysztof Piątek-Center Back-Bayern"]
[null,null,null,null,null,"Krzysztof Piątek-Center Back-Southampton"]
[null,null,null,null,null,"Krzysztof Piątek-Center Back-Arsenal"]
[null,null,null,null,null,"Piotr Zieliński-Forward-Barcelona"]
[null,null,null,null,null,"Piotr Zieliński-Forward-Juventus"]
[null,null,null,null,null,"Piotr Zieliński-Forward-Napoli"]
[null,null,null,null,null,"Piotr Zieliński-Forward-Bayern"]
[null,null,null,null,null,"Piotr Zieliński-Forward-Southampton"]
[null,null,null,null,null,"Piotr Zieliński-Forward-Arsenal"]
[null,null,null,null,null,"Piotr Zieliński-Goalkeeper-Barcelona"]
[null,null,null,null,null,"Piotr Zieliński-Goalkeeper-Juventus"]
[null,null,null,null,null,"Piotr Zieliński-Goalkeeper-Napoli"]
[null,null,null,null,null,"Piotr Zieliński-Goalkeeper-Bayern"]
[null,null,null,null,null,"Piotr Zieliński-Goalkeeper-Southampton"]
[null,null,null,null,null,"Piotr Zieliński-Goalkeeper-Arsenal"]
[null,null,null,null,null,"Piotr Zieliński-Striker-Barcelona"]
[null,null,null,null,null,"Piotr Zieliński-Striker-Juventus"]
[null,null,null,null,null,"Piotr Zieliński-Striker-Napoli"]
[null,null,null,null,null,"Piotr Zieliński-Striker-Bayern"]
[null,null,null,null,null,"Piotr Zieliński-Striker-Southampton"]
[null,null,null,null,null,"Piotr Zieliński-Striker-Arsenal"]
[null,null,null,null,null,"Piotr Zieliński-Midfielder-Barcelona"]
[null,null,null,null,null,"Piotr Zieliński-Midfielder-Juventus"]
[null,null,null,null,null,"Piotr Zieliński-Midfielder-Napoli"]
[null,null,null,null,null,"Piotr Zieliński-Midfielder-Bayern"]
[null,null,null,null,null,"Piotr Zieliński-Midfielder-Southampton"]
[null,null,null,null,null,"Piotr Zieliński-Midfielder-Arsenal"]
[null,null,null,null,null,"Piotr Zieliński-Right Back-Barcelona"]
[null,null,null,null,null,"Piotr Zieliński-Right Back-Juventus"]
[null,null,null,null,null,"Piotr Zieliński-Right Back-Napoli"]
[null,null,null,null,null,"Piotr Zieliński-Right Back-Bayern"]
[null,null,null,null,null,"Piotr Zieliński-Right Back-Southampton"]
[null,null,null,null,null,"Piotr Zieliński-Right Back-Arsenal"]
[null,null,null,null,null,"Piotr Zieliński-Center Back-Barcelona"]
[null,null,null,null,null,"Piotr Zieliński-Center Back-Juventus"]
[null,null,null,null,null,"Piotr Zieliński-Center Back-Napoli"]
[null,null,null,null,null,"Piotr Zieliński-Center Back-Bayern"]
[null,null,null,null,null,"Piotr Zieliński-Center Back-Southampton"]
[null,null,null,null,null,"Piotr Zieliński-Center Back-Arsenal"]
[null,null,null,null,null,"Jan Bednarek-Forward-Barcelona"]
[null,null,null,null,null,"Jan Bednarek-Forward-Juventus"]
[null,null,null,null,null,"Jan Bednarek-Forward-Napoli"]
[null,null,null,null,null,"Jan Bednarek-Forward-Bayern"]
[null,null,null,null,null,"Jan Bednarek-Forward-Southampton"]
[null,null,null,null,null,"Jan Bednarek-Forward-Arsenal"]
[null,null,null,null,null,"Jan Bednarek-Goalkeeper-Barcelona"]
[null,null,null,null,null,"Jan Bednarek-Goalkeeper-Juventus"]
[null,null,null,null,null,"Jan Bednarek-Goalkeeper-Napoli"]
[null,null,null,null,null,"Jan Bednarek-Goalkeeper-Bayern"]
[null,null,null,null,null,"Jan Bednarek-Goalkeeper-Southampton"]
[null,null,null,null,null,"Jan Bednarek-Goalkeeper-Arsenal"]
[null,null,null,null,null,"Jan Bednarek-Striker-Barcelona"]
[null,null,null,null,null,"Jan Bednarek-Striker-Juventus"]
[null,null,null,null,null,"Jan Bednarek-Striker-Napoli"]
[null,null,null,null,null,"Jan Bednarek-Striker-Bayern"]
[null,null,null,null,null,"Jan Bednarek-Striker-Southampton"]
[null,null,null,null,null,"Jan Bednarek-Striker-Arsenal"]
[null,null,null,null,null,"Jan Bednarek-Midfielder-Barcelona"]
[null,null,null,null,null,"Jan Bednarek-Midfielder-Juventus"]
[null,null,null,null,null,"Jan Bednarek-Midfielder-Napoli"]
[null,null,null,null,null,"Jan Bednarek-Midfielder-Bayern"]
[null,null,null,null,null,"Jan Bednarek-Midfielder-Southampton"]
[null,null,null,null,null,"Jan Bednarek-Midfielder-Arsenal"]
[null,null,null,null,null,"Jan Bednarek-Right Back-Barcelona"]
[null,null,null,null,null,"Jan Bednarek-Right Back-Juventus"]
[null,null,null,null,null,"Jan Bednarek-Right Back-Napoli"]
[null,null,null,null,null,"Jan Bednarek-Right Back-Bayern"]
[null,null,null,null,null,"Jan Bednarek-Right Back-Southampton"]
[null,null,null,null,null,"Jan Bednarek-Right Back-Arsenal"]
[null,null,null,null,null,"Jan Bednarek-Center Back-Barcelona"]
[null,null,null,null,null,"Jan Bednarek-Center Back-Juventus"]
[null,null,null,null,null,"Jan Bednarek-Center Back-Napoli"]
[null,null,null,null,null,"Jan Bednarek-Center Back-Bayern"]
[null,null,null,null,null,"Jan Bednarek-Center Back-Southampton"]
[null,null,null,null,null,"Jan Bednarek-Center Back-Arsenal"]