{"text_format":"1","workbook":"xlsx","n_sheets":8,"sheets":["dataset","using formula","find&replace","search bar","vba","vba search","without udf","files and subfolder"],"not_rendered":{"charts":0,"images":0,"macros":1,"external_links":0,"defined_names":5,"comments":0,"pivot_tables":0},"unopened":[],"bounds":{"document_bytes":16777216,"sheet_cells":100000,"rows_first":2000,"rows_last":500,"rows_between":2000,"halvings":0,"cell_chars":16384,"cell_head_chars":4096},"cells_cut":0,"cells_raw":0,"read":"whole","date_system":"1900"}

{"sheet":"dataset","index":0,"n_rows":8,"n_cols":2,"rows_kept":8,"cut":false,"hidden":false,"merged":[]}
[]
[null,"Copy PDF File Names"]
[]
[null,"File Name with Path"]
[null,"C:\\Users\\user\\Desktop\\blog 127\\pdf files\\PDF doc4.pdf"]
[null,"C:\\Users\\user\\Desktop\\blog 127\\pdf files\\PDF doc3.pdf"]
[null,"C:\\Users\\user\\Desktop\\blog 127\\pdf files\\PDF doc2.pdf"]
[null,"C:\\Users\\user\\Desktop\\blog 127\\pdf files\\PDF doc1.pdf"]

{"sheet":"using formula","index":1,"n_rows":8,"n_cols":3,"rows_kept":8,"cut":false,"hidden":false,"merged":[[1,1,1,2]]}
[]
[null,"Using Formula"]
[]
[null,"File Name with Path","PDF Name"]
[null,"C:\\Users\\user\\Desktop\\blog 127\\pdf files\\PDF doc1.pdf",{"$f":"TRIM(RIGHT(SUBSTITUTE(B5,\"\\\",REPT(\" \",50)),50))","v":"PDF doc1.pdf"}]
[null,"C:\\Users\\user\\Desktop\\blog 127\\pdf files\\PDF doc2.pdf",{"$f":"TRIM(RIGHT(SUBSTITUTE(B6,\"\\\",REPT(\" \",50)),50))","v":"PDF doc2.pdf"}]
[null,"C:\\Users\\user\\Desktop\\blog 127\\pdf files\\PDF doc3.pdf","PDF doc3.pdf"]
[null,"C:\\Users\\user\\Desktop\\blog 127\\pdf files\\PDF doc4.pdf","PDF doc4.pdf"]

{"sheet":"find&replace","index":2,"n_rows":8,"n_cols":2,"rows_kept":8,"cut":false,"hidden":false,"merged":[]}
[]
[null,"Using Find and Replace Feature"]
[]
[null,"File Name with Path"]
[null,"PDF doc4.pdf"]
[null,"PDF doc3.pdf"]
[null,"PDF doc2.pdf"]
[null,"PDF doc1.pdf"]

{"sheet":"search bar","index":3,"n_rows":8,"n_cols":4,"rows_kept":8,"cut":false,"hidden":false,"merged":[[1,1,1,3]]}
[]
[null,"Using Google Search Bar"]
[]
[null,"File Name with Path","Size","Date Modified"]
[null,"PDF doc1.pdf","31.8 kB","10/27/22, 8:08:50 AM"]
[null,"PDF doc2.pdf","71.8 kB","10/27/22, 8:11:25 AM"]
[null,"PDF doc3.pdf","48.7 kB","10/27/22, 8:13:34 AM"]
[null,"PDF doc4.pdf","55.6 kB","10/27/22, 8:18:09 AM"]

{"sheet":"vba","index":4,"n_rows":12,"n_cols":6,"rows_kept":12,"cut":false,"hidden":false,"merged":[]}
[]
[null,"Using VBA"]
[]
[null,"File Names"]
[null,{"$f":"IF(RIGHT(IFERROR(INDEX(CopyPDFNames($B$12),ROW()-4),\"\"),3)=\"pdf\",\nIFERROR(INDEX(CopyPDFNames($B$12),ROW()-4),\"\"),\"\")","v":""},null,null,null,{"$f":"IF(RIGHT(IFERROR(INDEX(CopyPDFNames($B$12),ROW()-4),\"\"),3)=\"pdf\",IFERROR(INDEX(CopyPDFNames($B$12),ROW()-4),\"\"),\"\")","v":""}]
[null,{"$f":"IF(RIGHT(IFERROR(INDEX(CopyPDFNames($B$12),ROW()-4),\"\"),3)=\"pdf\",\nIFERROR(INDEX(CopyPDFNames($B$12),ROW()-4),\"\"),\"\")","v":"PDF doc1.pdf"}]
[null,{"$f":"IF(RIGHT(IFERROR(INDEX(CopyPDFNames($B$12),ROW()-4),\"\"),3)=\"pdf\",\nIFERROR(INDEX(CopyPDFNames($B$12),ROW()-4),\"\"),\"\")","v":"PDF doc2.pdf"}]
[null,{"$f":"IF(RIGHT(IFERROR(INDEX(CopyPDFNames($B$12),ROW()-4),\"\"),3)=\"pdf\",\nIFERROR(INDEX(CopyPDFNames($B$12),ROW()-4),\"\"),\"\")","v":"PDF doc3.pdf"}]
[null,{"$f":"IF(RIGHT(IFERROR(INDEX(CopyPDFNames($B$12),ROW()-4),\"\"),3)=\"pdf\",\nIFERROR(INDEX(CopyPDFNames($B$12),ROW()-4),\"\"),\"\")","v":"PDF doc4.pdf"}]
[null,{"$f":"IF(RIGHT(IFERROR(INDEX(CopyPDFNames($B$12),ROW()-4),\"\"),3)=\"pdf\",IFERROR(INDEX(CopyPDFNames($B$12),ROW()-4),\"\"),\"\")","v":""}]
[null,"Folder Location"]
[null,"C:\\Users\\user\\Desktop\\blog 127\\pdf files"]

{"sheet":"vba search","index":5,"n_rows":14,"n_cols":2,"rows_kept":14,"cut":false,"hidden":false,"merged":[]}
[]
[null,"Using VBA with Search Option"]
[]
[null,"Folder Location"]
[null,"C:\\Users\\user\\Desktop\\blog 127\\pdf files"]
[null,"pdf"]
[]
[null,"File Names"]
[null,{"$f":"IFERROR(INDEX(CopyPDFNamesExt($B$5,$B$6),ROW()-8),\"\")","v":"PDF doc1.pdf"}]
[null,{"$f":"IFERROR(INDEX(CopyPDFNamesExt($B$5,$B$6),ROW()-8),\"\")","v":"PDF doc2.pdf"}]
[null,{"$f":"IFERROR(INDEX(CopyPDFNamesExt($B$5,$B$6),ROW()-8),\"\")","v":"PDF doc3.pdf"}]
[null,{"$f":"IFERROR(INDEX(CopyPDFNamesExt($B$5,$B$6),ROW()-8),\"\")","v":"PDF doc4.pdf"}]
[null,{"$f":"IFERROR(INDEX(CopyPDFNamesExt($B$5,$B$6),ROW()-8),\"\")","v":""}]
[null,{"$f":"IFERROR(INDEX(CopyPDFNamesExt($B$5,$B$6),ROW()-8),\"\")","v":""}]

{"sheet":"without udf","index":6,"n_rows":10,"n_cols":4,"rows_kept":10,"cut":false,"hidden":false,"merged":[[1,1,1,3]]}
[]
[null,"Using VBA Without User Defined Function"]
[]
[null,"Folder Name","File Name","File Extension"]
[null,"C:\\Users\\user\\Desktop\\blog 127\\pdf files","file sample","txt"]
[null,"C:\\Users\\user\\Desktop\\blog 127\\pdf files","PDF doc1","pdf"]
[null,"C:\\Users\\user\\Desktop\\blog 127\\pdf files","PDF doc2","pdf"]
[null,"C:\\Users\\user\\Desktop\\blog 127\\pdf files","PDF doc3","pdf"]
[null,"C:\\Users\\user\\Desktop\\blog 127\\pdf files","PDF doc4","pdf"]
[null,"C:\\Users\\user\\Desktop\\blog 127\\pdf files","test doc","docx"]

{"sheet":"files and subfolder","index":7,"n_rows":12,"n_cols":2,"rows_kept":12,"cut":false,"hidden":false,"merged":[]}
[]
[null,"Copying Files and Subfolder"]
[]
[null,"File Name with Path"]
[null,"test doc.docx"]
[null,"file sample.txt"]
[null,"Reports"]
[null,"PDF doc4.pdf"]
[null,"PDF doc3.pdf"]
[null,"PDF doc2.pdf"]
[null,"PDF doc1.pdf"]
[null,"Reports\\PDF doc5.pdf"]