{"text_format":"1","workbook":"xlsx","n_sheets":10,"sheets":["Dataset-1","Find and Select","Keyboard Shortcut","Dataset-2","Remove Form Controls Button","Dataset-3","Remove Form Controls Check Box","Remove All Form Controls","Dataset 4","Delete Macro Button"],"not_rendered":{"charts":0,"images":0,"macros":1,"external_links":0,"defined_names":2,"comments":0,"pivot_tables":0},"unopened":[],"bounds":{"document_bytes":16777216,"sheet_cells":100000,"rows_first":2000,"rows_last":500,"rows_between":2000,"halvings":0,"cell_chars":16384,"cell_head_chars":4096},"cells_cut":0,"cells_raw":0,"read":"whole","date_system":"1900"}

{"sheet":"Dataset-1","index":0,"n_rows":14,"n_cols":6,"rows_kept":14,"cut":false,"hidden":false,"merged":[[1,1,1,5]]}
[]
[null,"List of Employee Names"]
[]
[null,"ID","Employee Name",null,"ID",1]
[null,1,"Elizabeth Aldridge",null,"Employee Name",{"$f":"VLOOKUP(F4,B5:C14,2,FALSE)","v":"Elizabeth Aldridge"}]
[null,2,"Thomas Anderson"]
[null,3,"Jettie Long"]
[null,4,"Juliana Ross"]
[null,5,"Walter Vanburen"]
[null,6,"Matthew Wallace"]
[null,7,"Nancy Wilson"]
[null,8,"Justine Wofford"]
[null,9,"James Pittman"]
[null,10,"William Maxbill"]

{"sheet":"Find and Select","index":1,"n_rows":14,"n_cols":16,"rows_kept":14,"cut":false,"hidden":false,"merged":[[1,1,1,5],[1,11,1,15]]}
[]
[null,"Using Find and Select Option",null,null,null,null,null,null,null,null,null,"Do Yourself"]
[]
[null,"ID","Employee Name",null,"ID",1,null,null,null,null,null,"ID","Employee Name",null,"ID",1]
[null,1,"Elizabeth Aldridge",null,"Employee Name",{"$f":"VLOOKUP(F4,B5:C14,2,FALSE)","v":"Elizabeth Aldridge"},null,null,null,null,null,1,"Elizabeth Aldridge",null,"Employee Name",{"$f":"VLOOKUP(P4,L5:M14,2,FALSE)","v":"Elizabeth Aldridge"}]
[null,2,"Thomas Anderson",null,null,null,null,null,null,null,null,2,"Thomas Anderson"]
[null,3,"Jettie Long",null,null,null,null,null,null,null,null,3,"Jettie Long"]
[null,4,"Juliana Ross",null,null,null,null,null,null,null,null,4,"Juliana Ross"]
[null,5,"Walter Vanburen",null,null,null,null,null,null,null,null,5,"Walter Vanburen"]
[null,6,"Matthew Wallace",null,null,null,null,null,null,null,null,6,"Matthew Wallace"]
[null,7,"Nancy Wilson",null,null,null,null,null,null,null,null,7,"Nancy Wilson"]
[null,8,"Justine Wofford",null,null,null,null,null,null,null,null,8,"Justine Wofford"]
[null,9,"James Pittman",null,null,null,null,null,null,null,null,9,"James Pittman"]
[null,10,"William Maxbill",null,null,null,null,null,null,null,null,10,"William Maxbill"]

{"sheet":"Keyboard Shortcut","index":2,"n_rows":14,"n_cols":16,"rows_kept":14,"cut":false,"hidden":false,"merged":[[1,1,1,5],[1,11,1,15]]}
[]
[null,"Using Keyboard Shortcut",null,null,null,null,null,null,null,null,null,"Do Yourself"]
[]
[null,"ID","Employee Name",null,"ID",1,null,null,null,null,null,"ID","Employee Name",null,"ID",1]
[null,1,"Elizabeth Aldridge",null,"Employee Name",{"$f":"VLOOKUP(F4,B5:C14,2,FALSE)","v":"Elizabeth Aldridge"},null,null,null,null,null,1,"Elizabeth Aldridge",null,"Employee Name",{"$f":"VLOOKUP(P4,L5:M14,2,FALSE)","v":"Elizabeth Aldridge"}]
[null,2,"Thomas Anderson",null,null,null,null,null,null,null,null,2,"Thomas Anderson"]
[null,3,"Jettie Long",null,null,null,null,null,null,null,null,3,"Jettie Long"]
[null,4,"Juliana Ross",null,null,null,null,null,null,null,null,4,"Juliana Ross"]
[null,5,"Walter Vanburen",null,null,null,null,null,null,null,null,5,"Walter Vanburen"]
[null,6,"Matthew Wallace",null,null,null,null,null,null,null,null,6,"Matthew Wallace"]
[null,7,"Nancy Wilson",null,null,null,null,null,null,null,null,7,"Nancy Wilson"]
[null,8,"Justine Wofford",null,null,null,null,null,null,null,null,8,"Justine Wofford"]
[null,9,"James Pittman",null,null,null,null,null,null,null,null,9,"James Pittman"]
[null,10,"William Maxbill",null,null,null,null,null,null,null,null,10,"William Maxbill"]

{"sheet":"Dataset-2","index":3,"n_rows":14,"n_cols":3,"rows_kept":14,"cut":false,"hidden":false,"merged":[[1,1,1,2]]}
[]
[null,"List of Idioms"]
[]
[null,"Serial Number","Idioms "]
[null,1,"a blessing in disguise"]
[null,2,"better late than never"]
[null,3,"bite the bullet"]
[null,4,"break a leg"]
[null,5,"call it a day"]
[null,6,"cutting corners"]
[null,7,"get your act together"]
[null,8,"pull someone's leg"]
[null,9,"the best of both worlds"]
[null,10,"let someone off the hook"]

{"sheet":"Remove Form Controls Button","index":4,"n_rows":14,"n_cols":13,"rows_kept":14,"cut":false,"hidden":false,"merged":[[1,1,1,2],[1,11,1,12]]}
[]
[null,"Removing Form Controls Button",null,null,null,null,null,null,null,null,null,"Do Yourself"]
[]
[null,"Serial Number","Idioms ",null,null,null,null,null,null,null,null,"Serial Number","Idioms "]
[null,1,"A blessing in disguise",null,null,null,null,null,null,null,null,1,"a blessing in disguise"]
[null,2,"Better late than never",null,null,null,null,null,null,null,null,2,"better late than never"]
[null,3,"Bite the bullet",null,null,null,null,null,null,null,null,3,"bite the bullet"]
[null,4,"Break a leg",null,null,null,null,null,null,null,null,4,"break a leg"]
[null,5,"Call it a day",null,null,null,null,null,null,null,null,5,"call it a day"]
[null,6,"Cutting corners",null,null,null,null,null,null,null,null,6,"cutting corners"]
[null,7,"Get your act together",null,null,null,null,null,null,null,null,7,"get your act together"]
[null,8,"Pull someone's leg",null,null,null,null,null,null,null,null,8,"pull someone's leg"]
[null,9,"The best of both worlds",null,null,null,null,null,null,null,null,9,"the best of both worlds"]
[null,10,"Let someone off the hook",null,null,null,null,null,null,null,null,10,"let someone off the hook"]

{"sheet":"Dataset-3","index":5,"n_rows":13,"n_cols":4,"rows_kept":13,"cut":false,"hidden":false,"merged":[[1,1,1,2]]}
[]
[null,"Checklist for PC"]
[]
[null,"Product","Availability"]
[null,"Mouse and Keyboard",null,false]
[null,"Monitor",null,false]
[null,"RAM",null,true]
[null,"Hard Drive",null,true]
[null,"Speaker",null,false]
[null,"Motherboard"]
[null,"Processor",null,true]
[null,"Graphics Card"]
[null,"UPS",null,false]

{"sheet":"Remove Form Controls Check Box","index":6,"n_rows":13,"n_cols":14,"rows_kept":13,"cut":false,"hidden":false,"merged":[[1,11,1,12]]}
[]
[null,"Removing Check Boxes",null,null,null,null,null,null,null,null,null,"Do Yourself"]
[]
[null,"Product",null,null,null,null,null,null,null,null,null,"Product","Availability"]
[null,"Mouse and Keyboard",false,null,null,null,null,null,null,null,null,"Mouse and Keyboard",null,false]
[null,"Monitor",false,null,null,null,null,null,null,null,null,"Monitor"]
[null,"RAM",true,null,null,null,null,null,null,null,null,"RAM",null,true]
[null,"Hard Drive",true,null,null,null,null,null,null,null,null,"Hard Drive",null,true]
[null,"Speaker",false,null,null,null,null,null,null,null,null,"Speaker"]
[null,"Motherboard",null,null,null,null,null,null,null,null,null,"Motherboard"]
[null,"Processor",true,null,null,null,null,null,null,null,null,"Processor",null,true]
[null,"Graphics Card",null,null,null,null,null,null,null,null,null,"Graphics Card"]
[null,"UPS",false,null,null,null,null,null,null,null,null,"UPS",null,false]

{"sheet":"Remove All Form Controls","index":7,"n_rows":13,"n_cols":14,"rows_kept":13,"cut":false,"hidden":false,"merged":[[1,11,1,12]]}
[]
[null,"Removing All Form Controls",null,null,null,null,null,null,null,null,null,"Do Yourself"]
[]
[null,"Product",null,null,null,null,null,null,null,null,null,"Product","Availability"]
[null,"Mouse and Keyboard",false,null,null,null,null,null,null,null,null,"Mouse and Keyboard",null,false]
[null,"Monitor",false,null,null,null,null,null,null,null,null,"Monitor"]
[null,"RAM",true,null,null,null,null,null,null,null,null,"RAM",null,true]
[null,"Hard Drive",true,null,null,null,null,null,null,null,null,"Hard Drive",null,true]
[null,"Speaker",false,null,null,null,null,null,null,null,null,"Speaker"]
[null,"Motherboard",null,null,null,null,null,null,null,null,null,"Motherboard"]
[null,"Processor",true,null,null,null,null,null,null,null,null,"Processor",null,true]
[null,"Graphics Card",null,null,null,null,null,null,null,null,null,"Graphics Card"]
[null,"UPS",false,null,null,null,null,null,null,null,null,"UPS",null,false]

{"sheet":"Dataset 4","index":8,"n_rows":14,"n_cols":3,"rows_kept":14,"cut":false,"hidden":false,"merged":[[1,1,1,2]]}
[]
[null,"Deleting Macro Button"]
[]
[null,"Name","Project Name"]
[null,"Claire","Alpha"]
[null,"Owen","Gamma"]
[null,"Anna","Gamma"]
[null,"Harry","Alpha"]
[null,"Tyler","Beta"]
[null,"Will","Beta"]
[null,"Owen","Alpha"]
[null,"Julie","Gamma"]
[null,"Maisie","Beta"]
[null,"Anna","Alpha"]

{"sheet":"Delete Macro Button","index":9,"n_rows":14,"n_cols":13,"rows_kept":14,"cut":false,"hidden":false,"merged":[[1,1,1,2],[1,11,1,12]]}
[]
[null,"Deleting Macro Button",null,null,null,null,null,null,null,null,null,"Do Yourself"]
[]
[null,"Name","Project Name",null,null,null,null,null,null,null,null,"Name","Project Name"]
[null,"Claire","Alpha",null,null,null,null,null,null,null,null,"Claire","Alpha"]
[null,"Owen","Gamma",null,null,null,null,null,null,null,null,"Owen","Gamma"]
[null,"Anna","Gamma",null,null,null,null,null,null,null,null,"Anna","Gamma"]
[null,"Harry","Alpha",null,null,null,null,null,null,null,null,"Harry","Alpha"]
[null,"Tyler","Beta",null,null,null,null,null,null,null,null,"Tyler","Beta"]
[null,"Will","Beta",null,null,null,null,null,null,null,null,"Will","Beta"]
[null,"Owen","Alpha",null,null,null,null,null,null,null,null,"Owen","Alpha"]
[null,"Julie","Gamma",null,null,null,null,null,null,null,null,"Julie","Gamma"]
[null,"Maisie","Beta",null,null,null,null,null,null,null,null,"Maisie","Beta"]
[null,"Anna","Alpha",null,null,null,null,null,null,null,null,"Anna","Alpha"]