{"text_format":"1","workbook":"xlsx","n_sheets":14,"sheets":["Filter","Copy-Filter","IFERROR &VLOOKUP","IFERROR &VLOOKUP (2)","Table","NEW_TABLE","VBA1","VBA1Copy","VBA2","VBA2Copy","Dynamic","New York","Texas","Los Angeles"],"not_rendered":{"charts":0,"images":0,"macros":1,"external_links":0,"defined_names":3,"comments":0,"pivot_tables":0},"unopened":[],"bounds":{"document_bytes":16777216,"sheet_cells":100000,"rows_first":2000,"rows_last":500,"rows_between":2000,"halvings":0,"cell_chars":16384,"cell_head_chars":4096},"cells_cut":0,"cells_raw":0,"read":"whole","date_system":"1900"}

{"sheet":"Filter","index":0,"n_rows":11,"n_cols":4,"rows_kept":11,"cut":false,"hidden":false,"merged":[[1,1,1,3]]}
[]
[null,"Use of Filter Option"]
[]
[null,"Salesperson","Amount","City"]
[null,"John",500,"New York"]
[null,"Lisa",670,"Texas"]
[null,"Chris",580,"Los Angeles"]
[null,"Emma",630,"New York"]
[null,"Kate",780,"Dallas"]
[null,"Tony",650,"New York"]
[null,"Roy",700,"Texas"]

{"sheet":"Copy-Filter","index":1,"n_rows":7,"n_cols":4,"rows_kept":7,"cut":false,"hidden":false,"merged":[[1,1,1,3]]}
[]
[null,"Use of Filter Option"]
[]
[null,"Salesperson","Amount","City"]
[null,"Lisa",670,"Texas"]
[null,"Chris",580,"Los Angeles"]
[null,"Kate",780,"Dallas"]

{"sheet":"IFERROR &VLOOKUP","index":2,"n_rows":12,"n_cols":4,"rows_kept":12,"cut":false,"hidden":false,"merged":[[1,1,1,3]]}
[]
[null,"Use of IFERROR & VLOOKUP Functions"]
[]
[null,"Salesperson","Amount","City"]
[null,"John",500,"New York"]
[null,"Lisa",670,"Texas"]
[null,"Chris",580,"Los Angeles"]
[null,"Emma",630,"New York"]
[null,"Kate",780,"Dallas"]
[null,"Tony",650,"New York"]
[null,"Roy",700,"Texas"]
[null,"Jack",600,"Los Angeles"]

{"sheet":"IFERROR &VLOOKUP (2)","index":3,"n_rows":1000,"n_cols":4,"rows_kept":1000,"cut":false,"hidden":false,"merged":[[1,1,1,3]]}
[]
[null,"Use of IFERROR & VLOOKUP Functions"]
[]
[null,{"$f":"IFERROR(VLOOKUP('IFERROR &VLOOKUP'!$B$4:$B$1000, 'IFERROR &VLOOKUP'!$B$4:$D$1000, 1, FALSE), \"\")","v":"Salesperson"},{"$f":"IFERROR(VLOOKUP('IFERROR &VLOOKUP'!$B$4:$B$1000, 'IFERROR &VLOOKUP'!$B$4:$D$1000, 2, FALSE), \"\")","v":"Amount"},{"$f":"IFERROR(VLOOKUP('IFERROR &VLOOKUP'!$B$4:$B$1000, 'IFERROR &VLOOKUP'!$B$4:$D$1000, 3, FALSE), \"\")","v":"City"}]
[null,"John",500,"New York"]
[null,"Lisa",670,"Texas"]
[null,"Chris",580,"Los Angeles"]
[null,"Emma",630,"New York"]
[null,"Kate",780,"Dallas"]
[null,"Tony",650,"New York"]
[null,"Roy",700,"Texas"]
[null,"Jack",600,"Los Angeles"]
[null,"","",""]
[null,"","",""]
[null,"","",""]
[null,"","",""]
[null,"","",""]
[null,"","",""]
[null,"","",""]
[null,"","",""]
[null,"","",""]
[null,"","",""]
[null,"","",""]
[null,"","",""]
[null,"","",""]
[null,"","",""]
[null,"","",""]
[null,"","",""]
[null,"","",""]
[null,"","",""]
[null,"","",""]
[null,"","",""]
[null,"","",""]
[null,"","",""]
[null,"","",""]
[null,"","",""]
[null,"","",""]
[null,"","",""]
[null,"","",""]
[null,"","",""]
[null,"","",""]
[null,"","",""]
[null,"","",""]
[null,"","",""]
[null,"","",""]
[null,"","",""]
[null,"","",""]
[null,"","",""]
[null,"","",""]
[null,"","",""]
[null,"","",""]
[null,"","",""]
[null,"","",""]
[null,"","",""]
[null,"","",""]
[null,"","",""]
[null,"","",""]
[null,"","",""]
[null,"","",""]
[null,"","",""]
[null,"","",""]
[null,"","",""]
[null,"","",""]
[null,"","",""]
[null,"","",""]
[null,"","",""]
[null,"","",""]
[null,"","",""]
[null,"","",""]
[null,"","",""]
[null,"","",""]
[null,"","",""]
[null,"","",""]
[null,"","",""]
[null,"","",""]
[null,"","",""]
[null,"","",""]
[null,"","",""]
[null,"","",""]
[null,"","",""]
[null,"","",""]
[null,"","",""]
[null,"","",""]
[null,"","",""]
[null,"","",""]
[null,"","",""]
[null,"","",""]
[null,"","",""]
[null,"","",""]
[null,"","",""]
[null,"","",""]
[null,"","",""]
[null,"","",""]
[null,"","",""]
[null,"","",""]
[null,"","",""]
[null,"","",""]
[null,"","",""]
[null,"","",""]
[null,"","",""]
[null,"","",""]
[null,"","",""]
[null,"","",""]
[null,"","",""]
[null,"","",""]
[null,"","",""]
[null,"","",""]
[null,"","",""]
[null,"","",""]
[null,"","",""]
[null,"","",""]
[null,"","",""]
[null,"","",""]
[null,"","",""]
[null,"","",""]
[null,"","",""]
[null,"","",""]
[null,"","",""]
[null,"","",""]
[null,"","",""]
[null,"","",""]
[null,"","",""]
[null,"","",""]
[null,"","",""]
[null,"","",""]
[null,"","",""]
[null,"","",""]
[null,"","",""]
[null,"","",""]
[null,"","",""]
[null,"","",""]
[null,"","",""]
[null,"","",""]
[null,"","",""]
[null,"","",""]
[null,"","",""]
[null,"","",""]
[null,"","",""]
[null,"","",""]
[null,"","",""]
[null,"","",""]
[null,"","",""]
[null,"","",""]
[null,"","",""]
[null,"","",""]
[null,"","",""]
[null,"","",""]
[null,"","",""]
[null,"","",""]
[null,"","",""]
[null,"","",""]
[null,"","",""]
[null,"","",""]
[null,"","",""]
[null,"","",""]
[null,"","",""]
[null,"","",""]
[null,"","",""]
[null,"","",""]
[null,"","",""]
[null,"","",""]
[null,"","",""]
[null,"","",""]
[null,"","",""]
[null,"","",""]
[null,"","",""]
[null,"","",""]
[null,"","",""]
[null,"","",""]
[null,"","",""]
[null,"","",""]
[null,"","",""]
[null,"","",""]
[null,"","",""]
[null,"","",""]
[null,"","",""]
[null,"","",""]
[null,"","",""]
[null,"","",""]
[null,"","",""]
[null,"","",""]
[null,"","",""]
[null,"","",""]
[null,"","",""]
[null,"","",""]
[null,"","",""]
[null,"","",""]
[null,"","",""]
[null,"","",""]
[null,"","",""]
[null,"","",""]
[null,"","",""]
[null,"","",""]
[null,"","",""]
[null,"","",""]
[null,"","",""]
[null,"","",""]
[null,"","",""]
[null,"","",""]
[null,"","",""]
[null,"","",""]
[null,"","",""]
[null,"","",""]
[null,"","",""]
[null,"","",""]
[null,"","",""]
[null,"","",""]
[null,"","",""]
[null,"","",""]
[null,"","",""]
[null,"","",""]
[null,"","",""]
[null,"","",""]
[null,"","",""]
[null,"","",""]
[null,"","",""]
[null,"","",""]
[null,"","",""]
[null,"","",""]
[null,"","",""]
[null,"","",""]
[null,"","",""]
[null,"","",""]
[null,"","",""]
[null,"","",""]
[null,"","",""]
[null,"","",""]
[null,"","",""]
[null,"","",""]
[null,"","",""]
[null,"","",""]
[null,"","",""]
[null,"","",""]
[null,"","",""]
[null,"","",""]
[null,"","",""]
[null,"","",""]
[null,"","",""]
[null,"","",""]
[null,"","",""]
[null,"","",""]
[null,"","",""]
[null,"","",""]
[null,"","",""]
[null,"","",""]
[null,"","",""]
[null,"","",""]
[null,"","",""]
[null,"","",""]
[null,"","",""]
[null,"","",""]
[null,"","",""]
[null,"","",""]
[null,"","",""]
[null,"","",""]
[null,"","",""]
[null,"","",""]
[null,"","",""]
[null,"","",""]
[null,"","",""]
[null,"","",""]
[null,"","",""]
[null,"","",""]
[null,"","",""]
[null,"","",""]
[null,"","",""]
[null,"","",""]
[null,"","",""]
[null,"","",""]
[null,"","",""]
[null,"","",""]
[null,"","",""]
[null,"","",""]
[null,"","",""]
[null,"","",""]
[null,"","",""]
[null,"","",""]
[null,"","",""]
[null,"","",""]
[null,"","",""]
[null,"","",""]
[null,"","",""]
[null,"","",""]
[null,"","",""]
[null,"","",""]
[null,"","",""]
[null,"","",""]
[null,"","",""]
[null,"","",""]
[null,"","",""]
[null,"","",""]
[null,"","",""]
[null,"","",""]
[null,"","",""]
[null,"","",""]
[null,"","",""]
[null,"","",""]
[null,"","",""]
[null,"","",""]
[null,"","",""]
[null,"","",""]
[null,"","",""]
[null,"","",""]
[null,"","",""]
[null,"","",""]
[null,"","",""]
[null,"","",""]
[null,"","",""]
[null,"","",""]
[null,"","",""]
[null,"","",""]
[null,"","",""]
[null,"","",""]
[null,"","",""]
[null,"","",""]
[null,"","",""]
[null,"","",""]
[null,"","",""]
[null,"","",""]
[null,"","",""]
[null,"","",""]
[null,"","",""]
[null,"","",""]
[null,"","",""]
[null,"","",""]
[null,"","",""]
[null,"","",""]
[null,"","",""]
[null,"","",""]
[null,"","",""]
[null,"","",""]
[null,"","",""]
[null,"","",""]
[null,"","",""]
[null,"","",""]
[null,"","",""]
[null,"","",""]
[null,"","",""]
[null,"","",""]
[null,"","",""]
[null,"","",""]
[null,"","",""]
[null,"","",""]
[null,"","",""]
[null,"","",""]
[null,"","",""]
[null,"","",""]
[null,"","",""]
[null,"","",""]
[null,"","",""]
[null,"","",""]
[null,"","",""]
[null,"","",""]
[null,"","",""]
[null,"","",""]
[null,"","",""]
[null,"","",""]
[null,"","",""]
[null,"","",""]
[null,"","",""]
[null,"","",""]
[null,"","",""]
[null,"","",""]
[null,"","",""]
[null,"","",""]
[null,"","",""]
[null,"","",""]
[null,"","",""]
[null,"","",""]
[null,"","",""]
[null,"","",""]
[null,"","",""]
[null,"","",""]
[null,"","",""]
[null,"","",""]
[null,"","",""]
[null,"","",""]
[null,"","",""]
[null,"","",""]
[null,"","",""]
[null,"","",""]
[null,"","",""]
[null,"","",""]
[null,"","",""]
[null,"","",""]
[null,"","",""]
[null,"","",""]
[null,"","",""]
[null,"","",""]
[null,"","",""]
[null,"","",""]
[null,"","",""]
[null,"","",""]
[null,"","",""]
[null,"","",""]
[null,"","",""]
[null,"","",""]
[null,"","",""]
[null,"","",""]
[null,"","",""]
{"$rows_left_out":601}
{"sheet":"Table","index":4,"n_rows":11,"n_cols":4,"rows_kept":11,"cut":false,"hidden":false,"merged":[[1,1,1,3]]}
[]
[null,"Use of Table Query Window"]
[]
[null,"Salesperson","Amount","City"]
[null,"John",500,"New York"]
[null,"Lisa",670,"Texas"]
[null,"Chris",580,"Los Angeles"]
[null,"Emma",630,"New York"]
[null,"Kate",780,"Dallas"]
[null,"Tony",650,"New York"]
[null,"Jack",600,"Los Angeles"]

{"sheet":"NEW_TABLE","index":5,"n_rows":8,"n_cols":5,"rows_kept":8,"cut":false,"hidden":false,"merged":[]}
["Salesperson","Amount","City","Index","Index.1"]
["John",500,"New York",0,1]
["Lisa",670,"Texas",1,2]
["Chris",580,"Los Angeles",2,3]
["Emma",630,"New York",3,4]
["Kate",780,"Dallas",4,5]
["Tony",650,"New York",5,6]
["Jack",600,"Los Angeles",6,7]

{"sheet":"VBA1","index":6,"n_rows":10,"n_cols":4,"rows_kept":10,"cut":false,"hidden":false,"merged":[[1,1,1,3]]}
[]
[null,"Use VBA Code and Keep Source Data"]
[]
[null,"Salesperson","Amount","City"]
[null,"John",500,"New York"]
[null,"Lisa",670,"Texas"]
[null,"Chris",580,"Los Angeles"]
[null,"Emma",630,"New York"]
[null,"Kate",780,"Dallas"]
[null,"Tony",650,"New York"]

{"sheet":"VBA1Copy","index":7,"n_rows":10,"n_cols":4,"rows_kept":10,"cut":false,"hidden":false,"merged":[[1,1,1,3]]}
[]
[null,"Use VBA Code and Keep Source Data"]
[]
[null,"Salesperson","Amount","City"]
[null,"John",500,"New York"]
[null,"Lisa",670,"Texas"]
[null,"Chris",580,"Los Angeles"]
[null,"Emma",630,"New York"]
[null,"Kate",780,"Dallas"]
[null,"Tony",650,"New York"]

{"sheet":"VBA2","index":8,"n_rows":4,"n_cols":3,"rows_kept":4,"cut":false,"hidden":false,"merged":[]}
["Salesperson","Amount","City"]
["Lisa",670,"Texas"]
["Chris",580,"Los Angeles"]
["Kate",780,"Dallas"]

{"sheet":"VBA2Copy","index":9,"n_rows":4,"n_cols":3,"rows_kept":4,"cut":false,"hidden":false,"merged":[]}
["Salesperson","Amount","City"]
["John",500,"New York"]
["Emma",630,"New York"]
["Tony",650,"New York"]

{"sheet":"Dynamic","index":10,"n_rows":10,"n_cols":4,"rows_kept":10,"cut":false,"hidden":false,"merged":[[1,1,1,3]]}
[]
[null,"Use of VBA Code to Copy "]
[]
[null,"City","Salesperson","Amount"]
[null,"New York","John",500]
[null,"Texas","Lisa",670]
[null,"Los Angeles","Chris",580]
[null,"New York","Emma",630]
[null,"Texas","Kate",780]
[null,"New York","Tony",650]

{"sheet":"New York","index":11,"n_rows":4,"n_cols":4,"rows_kept":4,"cut":false,"hidden":false,"merged":[]}
[]
[null,"New York","John",500]
[null,"New York","Emma",630]
[null,"New York","Tony",650]

{"sheet":"Texas","index":12,"n_rows":3,"n_cols":4,"rows_kept":3,"cut":false,"hidden":false,"merged":[]}
[]
[null,"Texas","Lisa",670]
[null,"Texas","Kate",780]

{"sheet":"Los Angeles","index":13,"n_rows":2,"n_cols":4,"rows_kept":2,"cut":false,"hidden":false,"merged":[]}
[]
[null,"Los Angeles","Chris",580]