{"text_format":"1","workbook":"xlsx","n_sheets":30,"sheets":["Home Page","Dataset 1","1.1 CF(Duplicate Values)","1.2 CF(COUNTIF)","1.3 CF(Triplicates)","Dataset 2","1.4 CF(two WS)","1.5 CF(Rows)","2.1 COUNTIF","2.2 IF+COUNTIF","3.1 COUNTIF","3.2 SUM","3.3 IF+SUM","3.4 COUNTIFS","3.5 SUMPRODUCT","4..1 IF+COUNTIFS","4.2 SUMPRODUCT","5. Excl. 1st","6. Case Sensitive","7.1a From Two List(IFERR+VLOOK)","7.1b From Two List(UNI+FIL)","7.2 From Three List","8. Between Two WS","9. Betwen Two WB","10. VBA Macro","11.1 Return(IF+COUNTIF)","11.2 Return(UNIQUE+FILTER)","11.3 Return(VLOOKUP+COUNTIF)","Select,Copy,Move, Remove,Hide","Sheet1"],"not_rendered":{"charts":0,"images":1,"macros":1,"external_links":1,"defined_names":1,"comments":0,"pivot_tables":0},"unopened":[],"bounds":{"document_bytes":16777216,"sheet_cells":100000,"rows_first":2000,"rows_last":500,"rows_between":2000,"halvings":0,"cell_chars":16384,"cell_head_chars":4096},"cells_cut":0,"cells_raw":0,"read":"whole","date_system":"1900"}

{"sheet":"Home Page","index":0,"n_rows":47,"n_cols":4,"rows_kept":47,"cut":false,"hidden":false,"merged":[]}
[]
[]
[]
[]
[null,"Find Duplicates in Excel"]
[]
[null,"Learn to find duplicates with this free workbook. Read the article and practice yourself."]
[]
{"$rows_left_out":40}
{"sheet":"Dataset 1","index":1,"n_rows":22,"n_cols":5,"rows_kept":22,"cut":false,"hidden":false,"merged":[]}
[null,"Find Duplicates in Excel"]
[]
[null,"Sample Dataset"]
[]
[null,"Employee ID","Employee Name","Joining Year","Salary"]
[null,"A124","Morris King",2019,20000]
[null,"A054","John Smith",2020,25000]
[null,"A231","Alisha Stokes",2019,25000]
{"$rows_left_out":15}
{"sheet":"1.1 CF(Duplicate Values)","index":2,"n_rows":22,"n_cols":8,"rows_kept":22,"cut":false,"hidden":false,"merged":[]}
[null,"Find Duplicates with Conditional Formatting Tool"]
[]
[null,"Using Duplicate Values Command",null,null,null,null,null,"Practice Yourself"]
[]
[null,"Employee Name",null,"Pro Tips:",null,null,null,"Employee Name"]
[null,"Morris King",null,"1. Click Home => Conditional Formatting",null,null,null,"Morris King"]
[null,"John Smith",null,"2.Select Highlight Cell Rules => Duplicate Values",null,null,null,"John Smith"]
[null,"Alisha Stokes",null,"3. Select Duplicate and Choose color.",null,null,null,"Alisha Stokes"]
{"$rows_left_out":15}
{"sheet":"1.2 CF(COUNTIF)","index":3,"n_rows":22,"n_cols":10,"rows_kept":22,"cut":false,"hidden":false,"merged":[]}
[null,"Find Duplicates with Conditional Formatting Tool"]
[]
[null,"Using COUNTIF Function",null,null,null,null,null,null,null,"Practice Yourself"]
[]
[null,"Employee Name",null,"Pro Tips:",null,null,null,null,null,"Employee Name"]
[null,"Morris King",null,"1. Click Home => Conditional Formatting => New Rule",null,null,null,null,null,"Morris King"]
[null,"John Smith",null,"2. Select Use a formula to Determine which cells to format",null,null,null,null,null,"John Smith"]
[null,"Alisha Stokes",null,"3. Insert formula and select cell Fill Color.",null,null,null,null,null,"Alisha Stokes"]
{"$rows_left_out":15}
{"sheet":"1.3 CF(Triplicates)","index":4,"n_rows":22,"n_cols":10,"rows_kept":22,"cut":false,"hidden":false,"merged":[]}
[null,"Find Duplicates with Conditional Formatting Tool"]
[]
[null,"Finding Triplicates",null,null,null,null,null,null,null,"Practice Yourself"]
[]
[null,"Employee Name",null,"Pro Tips:",null,null,null,null,null,"Employee Name"]
[null,"Morris King",null,"1. Click Home => Conditional Formatting => New Rule",null,null,null,null,null,"Morris King"]
[null,"John Smith",null,"2. Select Use a formula to Determine which cells to format",null,null,null,null,null,"John Smith"]
[null,"Alisha Stokes",null,"3. Insert formula and select cell Fill Color.",null,null,null,null,null,"Alisha Stokes"]
{"$rows_left_out":15}
{"sheet":"Dataset 2","index":5,"n_rows":18,"n_cols":2,"rows_kept":18,"cut":false,"hidden":false,"merged":[]}
[null,"Sample Dataset"]
[]
[null,"Employee Name"]
[null,"Benjamin Russel"]
[null,"Steve Austin"]
[null,"Stephen Dulbarg"]
[null,"Usman Khaja"]
[null,"Steve Moor"]
{"$rows_left_out":11}
{"sheet":"1.4 CF(two WS)","index":6,"n_rows":19,"n_cols":8,"rows_kept":19,"cut":false,"hidden":false,"merged":[]}
[null,"Find Duplicates with Conditional Formatting Tool"]
[]
[null,"Highlighting Duplicates from Two Different Sheets (Dataset 2)",null,null,null,null,null,"Practice Yourself"]
[]
[null,"Employee Name",null,"Pro Tips:",null,null,null,"Employee Name"]
[null,"Morris King",null,"1. Click Home => Conditional Formatting => New Rule",null,null,null,"Morris King"]
[null,"John Smith",null,"2. Select Use a formula to Determine which cells to format",null,null,null,"John Smith"]
[null,"Alisha Stokes",null,"3. Insert formula and select cell Fill Color.",null,null,null,"Alisha Stokes"]
{"$rows_left_out":12}
{"sheet":"1.5 CF(Rows)","index":7,"n_rows":23,"n_cols":14,"rows_kept":23,"cut":false,"hidden":false,"merged":[]}
[null,"Find Duplicates with Conditional Formatting Tool"]
[]
[null,"Finding Duplicate Rows with COUNTIFS Function",null,null,null,null,null,null,null,null,"Practice Yourself"]
[]
[null,"Employee ID","Employee Name","Joining Year","Salary",null,"Pro Tips:",null,null,null,"Employee ID","Employee Name","Joining Year","Salary"]
[null,"A124","Morris King",2019,20000,null,"1. Click Home => Conditional Formatting => New Rule",null,null,null,"A124","Morris King",2019,20000]
[null,"A054","John Smith",2020,25000,null,"2. Select Use a formula to Determine which cells to format",null,null,null,"A054","John Smith",2020,25000]
[null,"A231","Alisha Stokes",2019,25000,null,"3. Insert formula and select cell Fill Color.",null,null,null,"A231","Alisha Stokes",2019,25000]
{"$rows_left_out":16}
{"sheet":"2.1 COUNTIF","index":8,"n_rows":23,"n_cols":8,"rows_kept":23,"cut":false,"hidden":false,"merged":[]}
[null,"Find Duplicate Values with Excel Formula"]
[]
[null,"Applying COUNTIF Function",null,null,null,null,"Practice Yourself"]
[]
[null,"Employee Name","Duplicate?",null,null,null,"Employee Name","Duplicate?"]
[null,"Morris King",{"$f":"COUNTIF($B:$B,B6)>1","v":true},null,null,null,"Morris King"]
[null,"John Smith",{"$f":"COUNTIF($B:$B,B7)>1","v":false},null,null,null,"John Smith"]
[null,"Alisha Stokes",true,null,null,null,"Alisha Stokes"]
{"$rows_left_out":16}
{"sheet":"2.2 IF+COUNTIF","index":9,"n_rows":23,"n_cols":9,"rows_kept":23,"cut":false,"hidden":false,"merged":[]}
[null,"Find Duplicate Values with Excel Formula"]
[]
[null,"Combining IF and COUNTIF Functions",null,null,null,null,null,"Practice Yourself"]
[]
[null,"Employee Name","Duplicate?",null,null,null,null,"Employee Name","Duplicate?"]
[null,"Morris King",{"$f":"IF(COUNTIF($B$6:$B$19,$B6)>1,\"Duplicate\",\"\")","v":"Duplicate"},null,null,null,null,"Morris King"]
[null,"John Smith",{"$f":"IF(COUNTIF($B$6:$B$19,$B7)>1,\"Duplicate\",\"\")","v":""},null,null,null,null,"John Smith"]
[null,"Alisha Stokes","Duplicate",null,null,null,null,"Alisha Stokes"]
{"$rows_left_out":16}
{"sheet":"3.1 COUNTIF","index":10,"n_rows":23,"n_cols":8,"rows_kept":23,"cut":false,"hidden":false,"merged":[]}
[null,"Find Duplicates and Return Number of Occurrences"]
[]
[null,"Using COUNTIF Function",null,null,null,null,"Practice Yourself"]
[]
[null,"Employee Name","Number of Occurrence",null,null,null,"Employee Name","Number of Occurrence"]
[null,"Morris King",{"$f":"COUNTIF($B$6:$B$19,$B6)","v":2},null,null,null,"Morris King"]
[null,"John Smith",{"$f":"COUNTIF($B$6:$B$19,$B7)","v":1},null,null,null,"John Smith"]
[null,"Alisha Stokes",2,null,null,null,"Alisha Stokes"]
{"$rows_left_out":16}
{"sheet":"3.2 SUM","index":11,"n_rows":23,"n_cols":8,"rows_kept":23,"cut":false,"hidden":false,"merged":[]}
[null,"Find Duplicates and Return Number of Occurrences"]
[]
[null,"Using SUM Function",null,null,null,null,"Practice Yourself"]
[]
[null,"Employee Name","Number of Occurrence",null,null,null,"Employee Name","Number of Occurrence"]
[null,"Morris King",{"$f":"SUM(--($B$6:$B$19 = $B6))","v":2},null,null,null,"Morris King"]
[null,"John Smith",{"$f":"SUM(--($B$6:$B$19 = $B7))","v":1},null,null,null,"John Smith"]
[null,"Alisha Stokes",{"$f":"SUM(--($B$6:$B$19 = $B8))","v":2},null,null,null,"Alisha Stokes"]
{"$rows_left_out":16}
{"sheet":"3.3 IF+SUM","index":12,"n_rows":23,"n_cols":8,"rows_kept":23,"cut":false,"hidden":false,"merged":[]}
[null,"Find Duplicates and Return Number of Occurrences"]
[]
[null,"Combining IF and SUM Functions",null,null,null,null,"Practice Yourself"]
[]
[null,"Employee Name","Number of Occurrence",null,null,null,"Employee Name","Number of Occurrence"]
[null,"Morris King",{"$f":"SUM(IF($B$6:$B$19=$B6,1,0))","v":2},null,null,null,"Morris King"]
[null,"John Smith",{"$f":"SUM(IF($B$6:$B$19=$B7,1,0))","v":1},null,null,null,"John Smith"]
[null,"Alisha Stokes",{"$f":"SUM(IF($B$6:$B$19=$B8,1,0))","v":2},null,null,null,"Alisha Stokes"]
{"$rows_left_out":16}
{"sheet":"3.4 COUNTIFS","index":13,"n_rows":24,"n_cols":15,"rows_kept":24,"cut":false,"hidden":false,"merged":[[7,7,10,8]]}
[null,"Find Duplicates and Return Number of Occurances"]
[]
[null,"Using COUNTIFS Function to Find Duplicate Rows",null,null,null,null,null,null,null,null,"Practice Yourself"]
[]
[null,"Employee ID","Employee Name","Joining Year","Salary","Number of Occurance",null,null,null,null,"Employee ID","Employee Name","Joining Year","Salary","Number of Occurance"]
[null,"A124","Morris King",2019,20000,{"$f":"COUNTIFS($B$6:$B$19,$B6,$C$6:$C$19,$C6,$D$6:$D$19,$D6,$E$6:$E$19,$E6)","v":2},null,null,null,null,"A124","Morris King",2019,20000]
[null,"A054","John Smith",2020,25000,{"$f":"COUNTIFS($B$6:$B$19,$B7,$C$6:$C$19,$C7,$D$6:$D$19,$D7,$E$6:$E$19,$E7)","v":1},null,"Note:",null,null,"A054","John Smith",2020,25000]
[null,"A231","Alisha Stokes",2019,25000,1,null,"C16 = Usman Khaja is ignored due to different Employee ID, Joining Year and Salary.",null,null,"A231","Alisha Stokes",2019,25000]
{"$rows_left_out":17}
{"sheet":"3.5 SUMPRODUCT","index":14,"n_rows":24,"n_cols":15,"rows_kept":24,"cut":false,"hidden":false,"merged":[[9,7,12,8]]}
[null,"Find Duplicate Values and Return Number of Occurrences"]
[]
[null,"Using SUMPRODUCT Function",null,null,null,null,null,null,null,null,"Practice Yourself"]
[]
[null,"Employee ID","Employee Name","Joining Year","Salary","Number of Occurrence",null,null,null,null,"Employee ID","Employee Name","Joining Year","Salary","Number of Occurrence"]
[null,"A124","Morris King",2019,20000,{"$f":"SUMPRODUCT(($B$6:$B$19=$B6)*1,($C$6:$C$19=$C6)*1,($D$6:$D$19=$D6)*1)","v":2},null,null,null,null,"A124","Morris King",2019,20000]
[null,"A054","John Smith",2020,25000,{"$f":"SUMPRODUCT(($B$6:$B$19=$B7)*1,($C$6:$C$19=$C7)*1,($D$6:$D$19=$D7)*1)","v":1},null,null,null,null,"A054","John Smith",2020,25000]
[null,"A231","Alisha Stokes",2019,25000,{"$f":"SUMPRODUCT(($B$6:$B$19=$B8)*1,($C$6:$C$19=$C8)*1,($D$6:$D$19=$D8)*1)","v":1},null,null,null,null,"A231","Alisha Stokes",2019,25000]
{"$rows_left_out":17}
{"sheet":"4..1 IF+COUNTIFS","index":15,"n_rows":23,"n_cols":16,"rows_kept":23,"cut":false,"hidden":false,"merged":[[8,7,10,9]]}
[null,"Find Duplicate Rows with Excel Functions"]
[]
[null,"Combining IF and COUNTIFS Functions",null,null,null,null,null,null,null,null,null,"Practice Yourself"]
[]
[null,"Employee ID","Employee Name","Joining Year","Salary","Duplicate?",null,null,null,null,null,"Employee ID","Employee Name","Joining Year","Salary","Duplicate?"]
[null,"A124","Morris King",2019,20000,{"$f":"IF(COUNTIFS($B$6:$B$19,$B6,$C$6:$C$19,$C6,$D$6:$D$19,$D6,$E$6:$E$19,$E6)>1,\"Duplicate\",\"Unique \")","v":"Duplicate"},null,null,null,null,null,"A124","Morris King",2019,20000]
[null,"A054","John Smith",2020,25000,{"$f":"IF(COUNTIFS($B$6:$B$19,$B7,$C$6:$C$19,$C7,$D$6:$D$19,$D7,$E$6:$E$19,$E7)>1,\"Duplicate\",\"Unique \")","v":"Unique "},null,null,null,null,null,"A054","John Smith",2020,25000]
[null,"A231","Alisha Stokes",2019,25000,"Unique ",null,"Note:",null,null,null,"A231","Alisha Stokes",2019,25000]
{"$rows_left_out":16}
{"sheet":"4.2 SUMPRODUCT","index":16,"n_rows":23,"n_cols":16,"rows_kept":23,"cut":false,"hidden":false,"merged":[[9,7,11,9]]}
[null,"Find Duplicate Rows with Excel Functions"]
[]
[null,"Combining IF and SUMPRODUCT Functions",null,null,null,null,null,null,null,null,null,"Practice Yourself"]
[]
[null,"Employee ID","Employee Name","Joining Year","Salary","Duplicate?",null,null,null,null,null,"Employee ID","Employee Name","Joining Year","Salary","Duplicate?"]
[null,"A124","Morris King",2019,20000,{"$f":"IF(SUMPRODUCT(($B$6:$B$19=$B6)*1,($C$6:$C$19=$C6)*1,($D$6:$D$19=$D6)*1,($E$6:$E$19=$E6)*1)>1,\"Duplicate\",\"Unique\")","v":"Duplicate"},null,null,null,null,null,"A124","Morris King",2019,20000]
[null,"A054","John Smith",2020,25000,{"$f":"IF(SUMPRODUCT(($B$6:$B$19=$B7)*1,($C$6:$C$19=$C7)*1,($D$6:$D$19=$D7)*1,($E$6:$E$19=$E7)*1)>1,\"Duplicate\",\"Unique\")","v":"Unique"},null,null,null,null,null,"A054","John Smith",2020,25000]
[null,"A231","Alisha Stokes",2019,25000,{"$f":"IF(SUMPRODUCT(($B$6:$B$19=$B8)*1,($C$6:$C$19=$C8)*1,($D$6:$D$19=$D8)*1,($E$6:$E$19=$E8)*1)>1,\"Duplicate\",\"Unique\")","v":"Unique"},null,null,null,null,null,"A231","Alisha Stokes",2019,25000]
{"$rows_left_out":16}
{"sheet":"5. Excl. 1st","index":17,"n_rows":23,"n_cols":8,"rows_kept":23,"cut":false,"hidden":false,"merged":[]}
[null,"Find Duplicates Excluding 1st Occurrence"]
[]
[null,"Using IF and COUNTIF Functions",null,null,null,null,"Practice Yourself"]
[]
[null,"Employee Name","Duplicate?",null,null,null,"Employee Name","Duplicate?"]
[null,"Morris King",{"$f":"IF(COUNTIF($B$6:$B6, $B6)>1, \"Duplicate\", \"\")","v":""},null,null,null,"Morris King"]
[null,"John Smith",{"$f":"IF(COUNTIF($B$6:$B7, $B7)>1, \"Duplicate\", \"\")","v":""},null,null,null,"John Smith"]
[null,"Alisha Stokes",{"$f":"IF(COUNTIF($B$6:$B8, $B8)>1, \"Duplicate\", \"\")","v":""},null,null,null,"Alisha Stokes"]
{"$rows_left_out":16}
{"sheet":"6. Case Sensitive","index":18,"n_rows":23,"n_cols":8,"rows_kept":23,"cut":false,"hidden":false,"merged":[]}
[null,"Find Case-Sensitive Duplicates with Excel Formula"]
[]
[null,"Combining IF, SUM, EXACT Functions",null,null,null,null,"Practice Yourself"]
[]
[null,"Employee Name","Duplicate?",null,null,null,"Employee Name","Duplicate?"]
[null,"Morris King",{"$f":"IF(SUM((--EXACT($B$6:$B$19,B6)))<=1,\"\",\"Duplicate\")","v":"Duplicate"},null,null,null,"Morris King"]
[null,"John Smith",{"$f":"IF(SUM((--EXACT($B$6:$B$19,B7)))<=1,\"\",\"Duplicate\")","v":""},null,null,null,"John Smith"]
[null,"Alisha Stokes",{"$f":"IF(SUM((--EXACT($B$6:$B$19,B8)))<=1,\"\",\"Duplicate\")","v":"Duplicate"},null,null,null,"Alisha Stokes"]
{"$rows_left_out":16}
{"sheet":"7.1a From Two List(IFERR+VLOOK)","index":19,"n_rows":23,"n_cols":12,"rows_kept":23,"cut":false,"hidden":false,"merged":[]}
[null,"Find Duplicates From Two Columns"]
[]
[null,"Combining IFERROR and VLOOKUP Functions",null,null,null,null,null,null,"Practice Yourself"]
[]
[null,"Employee List- 1","Employee List- 2",null,"Duplicate Names",null,null,null,"Employee List- 1","Employee List- 2",null,"Duplicate Names"]
[null,"Morris King","Benjamin Russel",null,{"$f":"IFERROR(VLOOKUP(C6,$B$6:$B$19,1,FALSE),\"-\")","v":"-"},null,null,null,"Morris King","Benjamin Russel"]
[null,"John Smith","Steve Austin",null,{"$f":"IFERROR(VLOOKUP(C7,$B$6:$B$19,1,FALSE),\"-\")","v":"-"},null,null,null,"John Smith","Steve Austin"]
[null,"Alisha Stokes","Stephen Dulbarg",null,"-",null,null,null,"Alisha Stokes","Stephen Dulbarg"]
{"$rows_left_out":16}
{"sheet":"7.1b From Two List(UNI+FIL)","index":20,"n_rows":23,"n_cols":12,"rows_kept":23,"cut":false,"hidden":false,"merged":[]}
[null,"Find Duplicates From Two Columns"]
[]
[null,"Combining UNIQUE, FILTER and COUNTIF Functions",null,null,null,null,null,null,"Practice Yourself"]
[]
[null,"Employee List- 1","Employee List- 2",null,"Duplicate Names",null,null,null,"Employee List- 1","Employee List- 2",null,"Duplicate Names"]
[null,"Morris King","Benjamin Russel",null,{"$f":"_xlfn.UNIQUE(_xlfn._xlws.FILTER(B6:B19,COUNTIF(C6:C17,B6:B19)>0))","v":"Alisha Stokes"},null,null,null,"Morris King","Benjamin Russel"]
[null,"John Smith","Steve Austin",null,"Usman Khaja",null,null,null,"John Smith","Steve Austin"]
[null,"Alisha Stokes","Stephen Dulbarg",null,"Steve Moor",null,null,null,"Alisha Stokes","Stephen Dulbarg"]
{"$rows_left_out":16}
{"sheet":"7.2 From Three List","index":21,"n_rows":23,"n_cols":14,"rows_kept":23,"cut":false,"hidden":false,"merged":[]}
[null,"Find Duplicates from Three Columns"]
[]
[null,"Combining FILTER and COUNTIF Functions",null,null,null,null,null,null,null,"Practice Yourself"]
[]
[null,"Employee List- 1","Employee List- 2","Employee List- 3",null,"Duplicate Names",null,null,null,"Employee List- 1","Employee List- 2","Employee List- 3",null,"Duplicate Names"]
[null,"Morris King","Benjamin Russel","Steve Moor",null,{"$f":"_xlfn._xlws.FILTER(_xlfn._xlws.FILTER(B6:B19,COUNTIF(C6:C17,B6:B19)>0),COUNTIF(D6:D14,_xlfn._xlws.FILTER(B6:B19,COUNTIF(C6:C17,B6:B19)>0))>0)","v":"Steve Moor"},null,null,null,"Morris King","Benjamin Russel","Steve Moor"]
[null,"John Smith","Steve Austin","Alisa Stokes",null,null,null,null,null,"John Smith","Steve Austin","Alisa Stokes"]
[null,"Alisha Stokes","Stephen Dulbarg","Wilfred Stones",null,null,null,null,null,"Alisha Stokes","Stephen Dulbarg","Wilfred Stones"]
{"$rows_left_out":16}
{"sheet":"8. Between Two WS","index":22,"n_rows":23,"n_cols":9,"rows_kept":23,"cut":false,"hidden":false,"merged":[]}
[null,"Find Duplicate Values Across Two Sheets (Dataset 2)"]
[]
[null,"Combining ISNUMBER and MATCH Functions",null,null,null,null,null,"Practice Yourself"]
[]
[null,"Employee Name","Duplicate?",null,null,null,null,"Employee Name","Duplicate?"]
[null,"Morris King",{"$f":"ISNUMBER(MATCH($B6,'Dataset 2'!B4:B15,0))","v":false},null,"Note:",null,null,"Morris King"]
[null,"John Smith",{"$f":"ISNUMBER(MATCH($B7,'Dataset 2'!B5:B16,0))","v":false},null,"We are using Dataset 2 as another worksheet.",null,null,"John Smith"]
[null,"Alisha Stokes",{"$f":"ISNUMBER(MATCH($B8,'Dataset 2'!B6:B17,0))","v":true},null,null,null,null,"Alisha Stokes"]
{"$rows_left_out":16}
{"sheet":"9. Betwen Two WB","index":23,"n_rows":23,"n_cols":8,"rows_kept":23,"cut":false,"hidden":false,"merged":[]}
[null,"Find Duplicates Between Two Workbooks (Source Data)"]
[]
[null,"Combining IF and COUNTIF Functions",null,null,null,null,"Practice Yourself"]
[]
[null,"Employee Name","Duplicate?",null,"Note:",null,"Employee Name","Duplicate?"]
[null,"Morris King",{"$f":"IF(COUNTIF([1]Dataset3!$B$4:$B$15,$B6),TRUE,FALSE)","v":{"$error":"#VALUE!"}},null,"1. You must open two workbooks at a time. Otherwise it will show #VALUE error.",null,"Morris King"]
[null,"John Smith",{"$f":"IF(COUNTIF([1]Dataset3!$B$4:$B$15,$B7),TRUE,FALSE)","v":{"$error":"#VALUE!"}},null,"2. Please fix the file directory while applying the formula.",null,"John Smith"]
[null,"Alisha Stokes",{"$f":"IF(COUNTIF([1]Dataset3!$B$4:$B$15,$B8),TRUE,FALSE)","v":{"$error":"#VALUE!"}},null,null,null,"Alisha Stokes"]
{"$rows_left_out":16}
{"sheet":"10. VBA Macro","index":24,"n_rows":24,"n_cols":7,"rows_kept":24,"cut":false,"hidden":false,"merged":[]}
[null,"Find Duplicates in Excel"]
[]
[null,"Using VBA Macro Tool",null,null,null,null,"Practice Yourself"]
[]
[null,"Employee Name",null,"Duplicate Names",null,null,"Employee Name"]
[null,"Morris King",null,"Morris King",null,null,"Morris King"]
[null,"John Smith",null,"Alisha Stokes",null,null,"John Smith"]
[null,"Alisha Stokes",null,"Usman Khaja",null,null,"Alisha Stokes"]
{"$rows_left_out":17}
{"sheet":"11.1 Return(IF+COUNTIF)","index":25,"n_rows":23,"n_cols":11,"rows_kept":23,"cut":false,"hidden":false,"merged":[]}
[null,"Return Duplicates with Excel Formula"]
[]
[null,"Returning Values Including All Occurrences",null,null,null,null,null,null,"Practice Yourself"]
[]
[null,"Employee Name",null,"Duplicate Names",null,null,null,null,"Employee Name",null,"Duplicate Names"]
[null,"Morris King",null,{"$f":"IF(COUNTIF($B$6:$B$19,B6)>1,B6,\"\")","v":"Morris King"},null,null,null,null,"Morris King"]
[null,"John Smith",null,{"$f":"IF(COUNTIF($B$6:$B$19,B7)>1,B7,\"\")","v":""},null,null,null,null,"John Smith"]
[null,"Alisha Stokes",null,"Alisha Stokes",null,null,null,null,"Alisha Stokes"]
{"$rows_left_out":16}
{"sheet":"11.2 Return(UNIQUE+FILTER)","index":26,"n_rows":23,"n_cols":10,"rows_kept":23,"cut":false,"hidden":false,"merged":[]}
[null,"Return Duplicates with Excel Formula"]
[]
[null,"Returning Values Only Once",null,null,null,null,null,"Practice Yourself"]
[]
[null,"Employee Name",null,"Duplicate Names",null,null,null,"Employee Name",null,"Duplicate Names"]
[null,"Morris King",null,{"$f":"_xlfn.UNIQUE(_xlfn._xlws.FILTER(B6:B19,COUNTIF(B6:B19,B6:B19)>1))","v":"Morris King"},null,null,null,"Morris King"]
[null,"John Smith",null,"Alisha Stokes",null,null,null,"John Smith"]
[null,"Alisha Stokes",null,"usman khaja",null,null,null,"Alisha Stokes"]
{"$rows_left_out":16}
{"sheet":"11.3 Return(VLOOKUP+COUNTIF)","index":27,"n_rows":24,"n_cols":11,"rows_kept":24,"cut":false,"hidden":false,"merged":[]}
[null,"Return Duplicates Comparing with Another Sheet (Dataset 2)"]
[]
[null,"Using VLOOKUP Function",null,null,null,null,null,null,"Practice Yourself"]
[]
[null,"Employee Name",null,"Duplicate Names",null,"Note:",null,null,"Employee Name",null,"Duplicate Names"]
[null,"Morris King",null,{"$f":"IFERROR(VLOOKUP(B6,'Dataset 2'!$B$4:$B$15, 1, FALSE),\"-\")","v":"-"},null,"We are using Dataset 2 as another worksheet.",null,null,"Morris King"]
[null,"John Smith",null,{"$f":"IFERROR(VLOOKUP(B7,'Dataset 2'!$B$4:$B$15, 1, FALSE),\"-\")","v":"-"},null,null,null,null,"John Smith"]
[null,"Alisha Stokes",null,{"$f":"IFERROR(VLOOKUP(B8,'Dataset 2'!$B$4:$B$15, 1, FALSE),\"-\")","v":"Alisha Stokes"},null,null,null,null,"Alisha Stokes"]
{"$rows_left_out":17}
{"sheet":"Select,Copy,Move, Remove,Hide","index":28,"n_rows":26,"n_cols":16,"rows_kept":26,"cut":false,"hidden":false,"merged":[]}
[null,"Select, Copy, Move, Remove and Hide Duplicates in Excel"]
[]
[null,"Using Filter Tool",null,null,null,null,null,null,null,null,null,"Practice Yourself"]
[]
[null,"Employee ID","Employee Name","Joining Year","Salary","Duplicate?",null,null,null,null,null,"Employee ID","Employee Name","Joining Year","Salary","Duplicate?"]
[null,"A124","Morris King",2019,20000,{"$f":"IF(COUNTIFS($B$6:$B$19,$B6,$C$6:$C$19,$C6,$D$6:$D$19,$D6,$E$6:$E$19,$E6)>1,\"Duplicate\",\"Unique \")","v":"Duplicate"},null,null,null,null,null,"A124","Morris King",2019,20000,{"$f":"IF(COUNTIFS($B$6:$B$19,$B6,$C$6:$C$19,$C6,$D$6:$D$19,$D6,$E$6:$E$19,$E6)>1,\"Duplicate\",\"Unique \")","v":"Duplicate"}]
[null,"A054","John Smith",2020,25000,{"$f":"IF(COUNTIFS($B$6:$B$19,$B7,$C$6:$C$19,$C7,$D$6:$D$19,$D7,$E$6:$E$19,$E7)>1,\"Duplicate\",\"Unique \")","v":"Unique "},null,null,null,null,null,"A054","John Smith",2020,25000,{"$f":"IF(COUNTIFS($B$6:$B$19,$B7,$C$6:$C$19,$C7,$D$6:$D$19,$D7,$E$6:$E$19,$E7)>1,\"Duplicate\",\"Unique \")","v":"Unique "}]
[null,"A231","Alisha Stokes",2019,25000,"Unique ",null,null,null,null,null,"A231","Alisha Stokes",2019,25000,"Unique "]
{"$rows_left_out":19}
{"sheet":"Sheet1","index":29,"n_rows":5,"n_cols":5,"rows_kept":5,"cut":false,"hidden":false,"merged":[]}
["Employee ID","Employee Name","Joining Year","Salary","Duplicate?"]
["A124","Morris King",2019,20000,"Duplicate"]
["A432","Usman Khaja",2018,18000,"Duplicate"]
["A124","Morris King",2019,20000,"Duplicate"]
["A432","Usman Khaja",2018,18000,"Duplicate"]